{"text_format":"1","workbook":"xlsx","n_sheets":2,"sheets":["2020_Virtual_Forum","UNWDF2020_LookUp"],"not_rendered":{"charts":0,"images":6,"macros":1,"external_links":3,"defined_names":52,"comments":0,"pivot_tables":0},"unopened":[],"bounds":{"document_bytes":16777216,"sheet_cells":100000,"rows_first":2000,"rows_last":500,"rows_between":2000,"halvings":0,"cell_chars":16384,"cell_head_chars":4096},"cells_cut":0,"cells_raw":0,"read":"whole","date_system":"1900"}

{"sheet":"2020_Virtual_Forum","index":0,"n_rows":90,"n_cols":17,"rows_kept":90,"cut":false,"hidden":false,"merged":[[0,5,0,11],[2,5,2,11],[1,5,1,11],[3,5,3,11],[48,5,50,5],[44,5,46,5],[47,6,47,16],[32,12,32,16],[10,5,12,5],[13,6,13,16],[14,5,16,5],[17,6,17,16],[18,5,20,5],[21,6,21,16],[43,6,43,16],[39,6,39,16],[88,9,88,10],[59,5,59,10],[88,6,88,7],[84,6,84,7],[84,9,84,10],[86,6,86,7],[86,9,86,10],[71,6,71,16],[72,5,74,5],[79,6,79,16],[64,5,66,5],[68,5,70,5],[76,5,78,5],[67,6,67,16],[75,6,75,16],[60,5,60,11],[40,5,42,5],[80,5,82,5],[62,5,63,5],[56,9,56,10],[52,6,52,7],[52,9,52,10],[54,6,54,7],[54,9,54,10],[56,6,56,7],[5,5,6,5],[7,5,9,5],[34,5,35,5],[36,5,38,5],[26,6,26,7],[32,5,32,11],[26,9,26,10],[28,6,28,7],[22,5,24,5],[28,9,28,10],[30,6,30,7],[30,9,30,10]]}
[null,null,null,"Day",19,"2020 VIRTUAL"]
[null,"NOW (Local time)",{"$f":"NOW()","v":"2020-10-17T23:02:22.310"},"Month",10,"UNITED NATIONS WORLD DATA FORUM"]
[null,"GMT/UTC",{"$f":"Local2GMT(NOW())","v":"2020-10-18T03:02:22.310"},"Year",2020,"Programme (as of 17 October 2020)*"]
["Day1",null,null,null,null,{"$f":"IF(ISERROR(DATE($E$3,$E$2,$E$1)+TIME(MID(E8,1,2),MID(E8,4,2),0)+($C$2-$C$3)),DATE($E$3,$E$2,$E$1),DATE($E$3,$E$2,$E$1)+TIME(MID(E8,1,2),MID(E8,4,2),0)+($C$2-$C$3))","v":"2020-10-19T06:30:00"}]
[null,null,"LookUp",null,null,null,"LookUp","Parallel 01","Parallel 02","Parallel 03","Parallel 04","Parallel 05","Parallel 06","Parallel 07","Parallel 08","Parallel 09","Parallel 10"]
[null,null,null,null,null,"Time (if macro is enabled will show your local system time, otherwise \"Coordinated Universal Time (UTC)\")","Name","Session 1","Session 2","Session 3","Session 4","Session 5","Session 6","Session 7","Session 8","Session 9","Session 10"]
["DayTime_LookUp","Day_LookUp","Time_LookUp","Col_LookUp","Time (GMT/UTC)",null,"Capacity"]
[{"$f":"B8&C8","v":"Day1Time_SlotO"},"Day1","Time_SlotO",14,"10:30 - 11:00 AM (UTC)",{"$f":"IF(ISERROR(TEXT((DATE($E$3,$E$2,$E$1)+TIME(MID(E8,1,2),MID(E8,4,2),0))+($C$2-$C$3),\"H:MM\")&\" - \"&TEXT(DATE($E$3,$E$2,$E$1)+TIME(MID(E8,9,2),MID(E8,12,2),0)+($C$2-$C$3),\"H:MM\")),E8,TEXT((DATE($E$3,$E$2,$E$1)+TIME(MID(E8,1,2),MID(E8,4,2),0))+($C$2-$C$3),\"HH:MM\")&\" - \"&TEXT(DATE($E$3,$E$2,$E$1)+TIME(MID(E8,9,2),MID(E8,12,2),0)+($C$2-$C$3),\"HH:MM\")&\" \"&TEXT(DATE($E$3,$E$2,$E$1)+TIME(MID(E8,9,2),MID(E8,12,2),0)+($C$2-$C$3),\"AM/PM\"))","v":"06:30 - 07:00 AM"},"Session_ID",{"$f":"IF(VLOOKUP($B8&\"_\"&$C8&\"_\"&H$5,UNWDF2020_LookUp!$B:$P,$D8,FALSE)=0,\"\",VLOOKUP($B8&\"_\"&$C8&\"_\"&H$5,UNWDF2020_LookUp!$B:$P,$D8,FALSE))","v":"TA_O.01"}]
["Day1Time_SlotO","Day1","Time_SlotO",12,null,null,"Thematic Area",{"$f":"IF(VLOOKUP($B9&\"_\"&$C9&\"_\"&H$5,UNWDF2020_LookUp!$B:$P,$D9,FALSE)=0,\"\",VLOOKUP($B9&\"_\"&$C9&\"_\"&H$5,UNWDF2020_LookUp!$B:$P,$D9,FALSE))","v":"_O"}]
["Day1Time_SlotO","Day1","Time_SlotO",15,null,null,"Session Title",{"$f":"IF(VLOOKUP($B10&\"_\"&$C10&\"_\"&H$5,UNWDF2020_LookUp!$B:$P,$D10,FALSE)=0,\"\",VLOOKUP($B10&\"_\"&$C10&\"_\"&H$5,UNWDF2020_LookUp!$B:$P,$D10,FALSE))","v":"Opening session"}]
[{"$f":"B11&C11","v":"Day1Time_Slot1"},"Day1","Time_Slot1",14,"11:00 - 12:15 PM (UTC)",{"$f":"IF(ISERROR(TEXT((DATE($E$3,$E$2,$E$1)+TIME(MID(E11,1,2),MID(E11,4,2),0))+($C$2-$C$3),\"H:MM\")&\" - \"&TEXT(DATE($E$3,$E$2,$E$1)+TIME(MID(E11,9,2),MID(E11,12,2),0)+($C$2-$C$3),\"H:MM\")),E11,TEXT((DATE($E$3,$E$2,$E$1)+TIME(MID(E11,1,2),MID(E11,4,2),0))+($C$2-$C$3),\"HH:MM\")&\" - \"&TEXT(DATE($E$3,$E$2,$E$1)+TIME(MID(E11,9,2),MID(E11,12,2),0)+($C$2-$C$3),\"HH:MM\")&\" \"&TEXT(DATE($E$3,$E$2,$E$1)+TIME(MID(E11,9,2),MID(E11,12,2),0)+($C$2-$C$3),\"AM/PM\"))","v":"07:00 - 08:15 AM"},"Session_ID",{"$f":"IF(VLOOKUP($B11&\"_\"&$C11&\"_\"&H$5,UNWDF2020_LookUp!$B:$P,$D11,FALSE)=0,\"\",VLOOKUP($B11&\"_\"&$C11&\"_\"&H$5,UNWDF2020_LookUp!$B:$P,$D11,FALSE))","v":"TA4.01"}]
["Day1Time_Slot1","Day1","Time_Slot1",12,null,null,"Thematic Area",{"$f":"IF(VLOOKUP($B12&\"_\"&$C12&\"_\"&H$5,UNWDF2020_LookUp!$B:$P,$D12,FALSE)=0,\"\",VLOOKUP($B12&\"_\"&$C12&\"_\"&H$5,UNWDF2020_LookUp!$B:$P,$D12,FALSE))","v":4}]
["Day1Time_Slot1","Day1","Time_Slot1",15,null,null,"Session Title",{"$f":"IF(VLOOKUP($B13&\"_\"&$C13&\"_\"&H$5,UNWDF2020_LookUp!$B:$P,$D13,FALSE)=0,\"\",VLOOKUP($B13&\"_\"&$C13&\"_\"&H$5,UNWDF2020_LookUp!$B:$P,$D13,FALSE))","v":"Data for a changing World: data use under Covid-19"}]
[null,"Day1",null,null,"12:15 - 12:30 PM (UTC)",{"$f":"IF(ISERROR(TEXT((DATE($E$3,$E$2,$E$1)+TIME(MID(E14,1,2),MID(E14,4,2),0))+($C$2-$C$3),\"H:MM\")&\" - \"&TEXT(DATE($E$3,$E$2,$E$1)+TIME(MID(E14,9,2),MID(E14,12,2),0)+($C$2-$C$3),\"H:MM\")),E14,TEXT((DATE($E$3,$E$2,$E$1)+TIME(MID(E14,1,2),MID(E14,4,2),0))+($C$2-$C$3),\"HH:MM\")&\" - \"&TEXT(DATE($E$3,$E$2,$E$1)+TIME(MID(E14,9,2),MID(E14,12,2),0)+($C$2-$C$3),\"HH:MM\")&\" \"&TEXT(DATE($E$3,$E$2,$E$1)+TIME(MID(E14,9,2),MID(E14,12,2),0)+($C$2-$C$3),\"AM/PM\"))","v":"08:15 - 08:30 AM"},"Break"]
["Day1Time_Slot2","Day1","Time_Slot2",14,"12:30 - 13:45 PM (UTC)","08:30 - 09:45 AM","Session_ID",{"$f":"IF(VLOOKUP($B15&\"_\"&$C15&\"_\"&H$5,UNWDF2020_LookUp!$B:$P,$D15,FALSE)=0,\"\",VLOOKUP($B15&\"_\"&$C15&\"_\"&H$5,UNWDF2020_LookUp!$B:$P,$D15,FALSE))","v":"TA2.01"},{"$f":"IF(VLOOKUP($B15&\"_\"&$C15&\"_\"&I$5,UNWDF2020_LookUp!$B:$P,$D15,FALSE)=0,\"\",VLOOKUP($B15&\"_\"&$C15&\"_\"&I$5,UNWDF2020_LookUp!$B:$P,$D15,FALSE))","v":"TA3.02"},{"$f":"IF(VLOOKUP($B15&\"_\"&$C15&\"_\"&J$5,UNWDF2020_LookUp!$B:$P,$D15,FALSE)=0,\"\",VLOOKUP($B15&\"_\"&$C15&\"_\"&J$5,UNWDF2020_LookUp!$B:$P,$D15,FALSE))","v":"TA4.02"},null,null,{"$f":"IF(VLOOKUP($B15&\"_\"&$C15&\"_\"&M$5,UNWDF2020_LookUp!$B:$P,$D15,FALSE)=0,\"\",VLOOKUP($B15&\"_\"&$C15&\"_\"&M$5,UNWDF2020_LookUp!$B:$P,$D15,FALSE))","v":"NA"},{"$f":"IF(VLOOKUP($B15&\"_\"&$C15&\"_\"&N$5,UNWDF2020_LookUp!$B:$P,$D15,FALSE)=0,\"\",VLOOKUP($B15&\"_\"&$C15&\"_\"&N$5,UNWDF2020_LookUp!$B:$P,$D15,FALSE))","v":"NA"},{"$f":"IF(VLOOKUP($B15&\"_\"&$C15&\"_\"&O$5,UNWDF2020_LookUp!$B:$P,$D15,FALSE)=0,\"\",VLOOKUP($B15&\"_\"&$C15&\"_\"&O$5,UNWDF2020_LookUp!$B:$P,$D15,FALSE))","v":"NA"},{"$f":"IF(VLOOKUP($B15&\"_\"&$C15&\"_\"&P$5,UNWDF2020_LookUp!$B:$P,$D15,FALSE)=0,\"\",VLOOKUP($B15&\"_\"&$C15&\"_\"&P$5,UNWDF2020_LookUp!$B:$P,$D15,FALSE))","v":"NA"},{"$f":"IF(VLOOKUP($B15&\"_\"&$C15&\"_\"&Q$5,UNWDF2020_LookUp!$B:$P,$D15,FALSE)=0,\"\",VLOOKUP($B15&\"_\"&$C15&\"_\"&Q$5,UNWDF2020_LookUp!$B:$P,$D15,FALSE))","v":"NA"}]
["Day1Time_Slot2","Day1","Time_Slot2",12,null,null,"Thematic Area",{"$f":"IF(VLOOKUP($B16&\"_\"&$C16&\"_\"&H$5,UNWDF2020_LookUp!$B:$P,$D16,FALSE)=0,\"\",VLOOKUP($B16&\"_\"&$C16&\"_\"&H$5,UNWDF2020_LookUp!$B:$P,$D16,FALSE))","v":2},{"$f":"IF(VLOOKUP($B16&\"_\"&$C16&\"_\"&I$5,UNWDF2020_LookUp!$B:$P,$D16,FALSE)=0,\"\",VLOOKUP($B16&\"_\"&$C16&\"_\"&I$5,UNWDF2020_LookUp!$B:$P,$D16,FALSE))","v":3},{"$f":"IF(VLOOKUP($B16&\"_\"&$C16&\"_\"&J$5,UNWDF2020_LookUp!$B:$P,$D16,FALSE)=0,\"\",VLOOKUP($B16&\"_\"&$C16&\"_\"&J$5,UNWDF2020_LookUp!$B:$P,$D16,FALSE))","v":4},null,null,{"$f":"IF(VLOOKUP($B16&\"_\"&$C16&\"_\"&M$5,UNWDF2020_LookUp!$B:$P,$D16,FALSE)=0,\"\",VLOOKUP($B16&\"_\"&$C16&\"_\"&M$5,UNWDF2020_LookUp!$B:$P,$D16,FALSE))","v":"NA"},{"$f":"IF(VLOOKUP($B16&\"_\"&$C16&\"_\"&N$5,UNWDF2020_LookUp!$B:$P,$D16,FALSE)=0,\"\",VLOOKUP($B16&\"_\"&$C16&\"_\"&N$5,UNWDF2020_LookUp!$B:$P,$D16,FALSE))","v":"NA"},{"$f":"IF(VLOOKUP($B16&\"_\"&$C16&\"_\"&O$5,UNWDF2020_LookUp!$B:$P,$D16,FALSE)=0,\"\",VLOOKUP($B16&\"_\"&$C16&\"_\"&O$5,UNWDF2020_LookUp!$B:$P,$D16,FALSE))","v":"NA"},{"$f":"IF(VLOOKUP($B16&\"_\"&$C16&\"_\"&P$5,UNWDF2020_LookUp!$B:$P,$D16,FALSE)=0,\"\",VLOOKUP($B16&\"_\"&$C16&\"_\"&P$5,UNWDF2020_LookUp!$B:$P,$D16,FALSE))","v":"NA"},{"$f":"IF(VLOOKUP($B16&\"_\"&$C16&\"_\"&Q$5,UNWDF2020_LookUp!$B:$P,$D16,FALSE)=0,\"\",VLOOKUP($B16&\"_\"&$C16&\"_\"&Q$5,UNWDF2020_LookUp!$B:$P,$D16,FALSE))","v":"NA"}]
["Day1Time_Slot2","Day1","Time_Slot2",15,null,null,"Session Title",{"$f":"IF(VLOOKUP($B17&\"_\"&$C17&\"_\"&H$5,UNWDF2020_LookUp!$B:$P,$D17,FALSE)=0,\"\",VLOOKUP($B17&\"_\"&$C17&\"_\"&H$5,UNWDF2020_LookUp!$B:$P,$D17,FALSE))","v":"Integrating Citizen Science into the Official SDG Monitoring Mechanisms and A Proposal to Use Unofficial Statistics for SDG Reporting (to Deal with Crises)"},{"$f":"IF(VLOOKUP($B17&\"_\"&$C17&\"_\"&I$5,UNWDF2020_LookUp!$B:$P,$D17,FALSE)=0,\"\",VLOOKUP($B17&\"_\"&$C17&\"_\"&I$5,UNWDF2020_LookUp!$B:$P,$D17,FALSE))","v":"Operationalising data to leave no one behind in the context of Covid-19: Practical steps from Benin and beyond"},{"$f":"IF(VLOOKUP($B17&\"_\"&$C17&\"_\"&J$5,UNWDF2020_LookUp!$B:$P,$D17,FALSE)=0,\"\",VLOOKUP($B17&\"_\"&$C17&\"_\"&J$5,UNWDF2020_LookUp!$B:$P,$D17,FALSE))","v":"Data Gems for the Public: Innovative ways and best practices to communicate official statistics"},null,null,{"$f":"IF(VLOOKUP($B17&\"_\"&$C17&\"_\"&M$5,UNWDF2020_LookUp!$B:$P,$D17,FALSE)=0,\"\",VLOOKUP($B17&\"_\"&$C17&\"_\"&M$5,UNWDF2020_LookUp!$B:$P,$D17,FALSE))","v":"TBC"},{"$f":"IF(VLOOKUP($B17&\"_\"&$C17&\"_\"&N$5,UNWDF2020_LookUp!$B:$P,$D17,FALSE)=0,\"\",VLOOKUP($B17&\"_\"&$C17&\"_\"&N$5,UNWDF2020_LookUp!$B:$P,$D17,FALSE))","v":"TBC"},{"$f":"IF(VLOOKUP($B17&\"_\"&$C17&\"_\"&O$5,UNWDF2020_LookUp!$B:$P,$D17,FALSE)=0,\"\",VLOOKUP($B17&\"_\"&$C17&\"_\"&O$5,UNWDF2020_LookUp!$B:$P,$D17,FALSE))","v":"TBC"},{"$f":"IF(VLOOKUP($B17&\"_\"&$C17&\"_\"&P$5,UNWDF2020_LookUp!$B:$P,$D17,FALSE)=0,\"\",VLOOKUP($B17&\"_\"&$C17&\"_\"&P$5,UNWDF2020_LookUp!$B:$P,$D17,FALSE))","v":"TBC"},{"$f":"IF(VLOOKUP($B17&\"_\"&$C17&\"_\"&Q$5,UNWDF2020_LookUp!$B:$P,$D17,FALSE)=0,\"\",VLOOKUP($B17&\"_\"&$C17&\"_\"&Q$5,UNWDF2020_LookUp!$B:$P,$D17,FALSE))","v":"NA"}]
[null,"Day1",null,null,"13:45 - 14:00 PM (UTC)",{"$f":"IF(ISERROR(TEXT((DATE($E$3,$E$2,$E$1)+TIME(MID(E18,1,2),MID(E18,4,2),0))+($C$2-$C$3),\"H:MM\")&\" - \"&TEXT(DATE($E$3,$E$2,$E$1)+TIME(MID(E18,9,2),MID(E18,12,2),0)+($C$2-$C$3),\"H:MM\")),E18,TEXT((DATE($E$3,$E$2,$E$1)+TIME(MID(E18,1,2),MID(E18,4,2),0))+($C$2-$C$3),\"HH:MM\")&\" - \"&TEXT(DATE($E$3,$E$2,$E$1)+TIME(MID(E18,9,2),MID(E18,12,2),0)+($C$2-$C$3),\"HH:MM\")&\" \"&TEXT(DATE($E$3,$E$2,$E$1)+TIME(MID(E18,9,2),MID(E18,12,2),0)+($C$2-$C$3),\"AM/PM\"))","v":"09:45 - 10:00 AM"},"Break"]
["Day1Time_Slot3","Day1","Time_Slot3",14,"14:00 - 15:15 PM (UTC)","10:00 - 11:15 AM","Session_ID",{"$f":"IF(VLOOKUP($B19&\"_\"&$C19&\"_\"&H$5,UNWDF2020_LookUp!$B:$P,$D19,FALSE)=0,\"\",VLOOKUP($B19&\"_\"&$C19&\"_\"&H$5,UNWDF2020_LookUp!$B:$P,$D19,FALSE))","v":"TA5.02"},{"$f":"IF(VLOOKUP($B19&\"_\"&$C19&\"_\"&I$5,UNWDF2020_LookUp!$B:$P,$D19,FALSE)=0,\"\",VLOOKUP($B19&\"_\"&$C19&\"_\"&I$5,UNWDF2020_LookUp!$B:$P,$D19,FALSE))","v":"TA2.02"},{"$f":"IF(VLOOKUP($B19&\"_\"&$C19&\"_\"&J$5,UNWDF2020_LookUp!$B:$P,$D19,FALSE)=0,\"\",VLOOKUP($B19&\"_\"&$C19&\"_\"&J$5,UNWDF2020_LookUp!$B:$P,$D19,FALSE))","v":"TA2.09"},null,null,{"$f":"IF(VLOOKUP($B19&\"_\"&$C19&\"_\"&M$5,UNWDF2020_LookUp!$B:$P,$D19,FALSE)=0,\"\",VLOOKUP($B19&\"_\"&$C19&\"_\"&M$5,UNWDF2020_LookUp!$B:$P,$D19,FALSE))","v":"NA"},{"$f":"IF(VLOOKUP($B19&\"_\"&$C19&\"_\"&N$5,UNWDF2020_LookUp!$B:$P,$D19,FALSE)=0,\"\",VLOOKUP($B19&\"_\"&$C19&\"_\"&N$5,UNWDF2020_LookUp!$B:$P,$D19,FALSE))","v":"NA"},{"$f":"IF(VLOOKUP($B19&\"_\"&$C19&\"_\"&O$5,UNWDF2020_LookUp!$B:$P,$D19,FALSE)=0,\"\",VLOOKUP($B19&\"_\"&$C19&\"_\"&O$5,UNWDF2020_LookUp!$B:$P,$D19,FALSE))","v":"NA"},{"$f":"IF(VLOOKUP($B19&\"_\"&$C19&\"_\"&P$5,UNWDF2020_LookUp!$B:$P,$D19,FALSE)=0,\"\",VLOOKUP($B19&\"_\"&$C19&\"_\"&P$5,UNWDF2020_LookUp!$B:$P,$D19,FALSE))","v":"NA"},{"$f":"IF(VLOOKUP($B19&\"_\"&$C19&\"_\"&Q$5,UNWDF2020_LookUp!$B:$P,$D19,FALSE)=0,\"\",VLOOKUP($B19&\"_\"&$C19&\"_\"&Q$5,UNWDF2020_LookUp!$B:$P,$D19,FALSE))","v":"NA"}]
["Day1Time_Slot3","Day1","Time_Slot3",12,null,null,"Thematic Area",{"$f":"IF(VLOOKUP($B20&\"_\"&$C20&\"_\"&H$5,UNWDF2020_LookUp!$B:$P,$D20,FALSE)=0,\"\",VLOOKUP($B20&\"_\"&$C20&\"_\"&H$5,UNWDF2020_LookUp!$B:$P,$D20,FALSE))","v":5},{"$f":"IF(VLOOKUP($B20&\"_\"&$C20&\"_\"&I$5,UNWDF2020_LookUp!$B:$P,$D20,FALSE)=0,\"\",VLOOKUP($B20&\"_\"&$C20&\"_\"&I$5,UNWDF2020_LookUp!$B:$P,$D20,FALSE))","v":2},{"$f":"IF(VLOOKUP($B20&\"_\"&$C20&\"_\"&J$5,UNWDF2020_LookUp!$B:$P,$D20,FALSE)=0,\"\",VLOOKUP($B20&\"_\"&$C20&\"_\"&J$5,UNWDF2020_LookUp!$B:$P,$D20,FALSE))","v":2},null,null,{"$f":"IF(VLOOKUP($B20&\"_\"&$C20&\"_\"&M$5,UNWDF2020_LookUp!$B:$P,$D20,FALSE)=0,\"\",VLOOKUP($B20&\"_\"&$C20&\"_\"&M$5,UNWDF2020_LookUp!$B:$P,$D20,FALSE))","v":"NA"},{"$f":"IF(VLOOKUP($B20&\"_\"&$C20&\"_\"&N$5,UNWDF2020_LookUp!$B:$P,$D20,FALSE)=0,\"\",VLOOKUP($B20&\"_\"&$C20&\"_\"&N$5,UNWDF2020_LookUp!$B:$P,$D20,FALSE))","v":"NA"},{"$f":"IF(VLOOKUP($B20&\"_\"&$C20&\"_\"&O$5,UNWDF2020_LookUp!$B:$P,$D20,FALSE)=0,\"\",VLOOKUP($B20&\"_\"&$C20&\"_\"&O$5,UNWDF2020_LookUp!$B:$P,$D20,FALSE))","v":"NA"},{"$f":"IF(VLOOKUP($B20&\"_\"&$C20&\"_\"&P$5,UNWDF2020_LookUp!$B:$P,$D20,FALSE)=0,\"\",VLOOKUP($B20&\"_\"&$C20&\"_\"&P$5,UNWDF2020_LookUp!$B:$P,$D20,FALSE))","v":"NA"},{"$f":"IF(VLOOKUP($B20&\"_\"&$C20&\"_\"&Q$5,UNWDF2020_LookUp!$B:$P,$D20,FALSE)=0,\"\",VLOOKUP($B20&\"_\"&$C20&\"_\"&Q$5,UNWDF2020_LookUp!$B:$P,$D20,FALSE))","v":"NA"}]
{"$rows_left_out":71}
{"sheet":"UNWDF2020_LookUp","index":1,"n_rows":158,"n_cols":19,"rows_kept":158,"cut":false,"hidden":true,"merged":[]}
["ID","LookUp","Day/Time","Day","Time_Slot","Location","Date","Time","Room_Name","Room_Capacity","UNWDF2020_Plenary","UNWDF2020_ProposalID","UNWDF2020_TA","UNWDF2020_Session","UNWDF2020_SessionID","UNWDF2020_SessionTitle"]
[1,{"$f":"C2&\"_\"&F2","v":"Day1_Time_SlotO_Parallel 01"},{"$f":"$D$1&D2&\"_\"&$E$1&E2","v":"Day1_Time_SlotO"},1,"O","Parallel 01",{"$f":"VLOOKUP($D$1&D2,'2020_Virtual_Forum'!A:F,6,FALSE)","v":"2020-10-19T06:30:00"},{"$f":"VLOOKUP($D$1&D2&$E$1&E2,'2020_Virtual_Forum'!A:F,5,FALSE)","v":"10:30 - 11:00 AM (UTC)"},{"$f":"HLOOKUP($F2,'2020_Virtual_Forum'!$H$5:$Q$7,2,FALSE)","v":"Session 1"},{"$f":"HLOOKUP($F2,'2020_Virtual_Forum'!$H$5:$Q$7,3,FALSE)","v":0},"Y","NA","_O",{"$f":"IF(K2=\"NA\",\"NA\",IF(K2=\"Y\",COUNTIF($M$1:M3,M2)+1,COUNTIF($M$1:M3,M2)+1))","v":2},"TA_O.01","Opening session"]
[11,{"$f":"C3&\"_\"&F3","v":"Day1_Time_Slot1_Parallel 01"},{"$f":"$D$1&D3&\"_\"&$E$1&E3","v":"Day1_Time_Slot1"},1,1,"Parallel 01",{"$f":"VLOOKUP($D$1&D3,'2020_Virtual_Forum'!A:F,6,FALSE)","v":"2020-10-19T06:30:00"},{"$f":"VLOOKUP($D$1&D3&$E$1&E3,'2020_Virtual_Forum'!A:F,5,FALSE)","v":"11:00 - 12:15 PM (UTC)"},{"$f":"HLOOKUP($F3,'2020_Virtual_Forum'!$H$5:$Q$7,2,FALSE)","v":"Session 1"},{"$f":"HLOOKUP($F3,'2020_Virtual_Forum'!$H$5:$Q$7,3,FALSE)","v":0},"Y","NA",4,{"$f":"IF(K3=\"NA\",\"NA\",IF(K3=\"Y\",COUNTIF($M$1:M1,M3)+1,COUNTIF($M$1:M1,M3)+1))","v":1},"TA4.01","Data for a changing World: data use under Covid-19"]
[61,"Day2_Time_Slot2_Parallel 01","Day2_Time_Slot2",2,2,"Parallel 01",{"$f":"VLOOKUP($D$1&D4,'2020_Virtual_Forum'!A:F,6,FALSE)","v":"2020-10-20T07:00:00"},{"$f":"VLOOKUP($D$1&D4&$E$1&E4,'2020_Virtual_Forum'!A:F,5,FALSE)","v":"12:30 - 13:45 PM (UTC)"},{"$f":"HLOOKUP($F4,'2020_Virtual_Forum'!$H$5:$Q$7,2,FALSE)","v":"Session 1"},{"$f":"HLOOKUP($F4,'2020_Virtual_Forum'!$H$5:$Q$7,3,FALSE)","v":0},"Y","NA",5,{"$f":"IF(K4=\"NA\",\"NA\",IF(K4=\"Y\",COUNTIF($M$1:M3,M4)+1,COUNTIF($M$1:M3,M4)+1))","v":1},"TA5.01","Trust, privacy and governance during pandemics and disasters"]
[121,"Day3_Time_Slot4_Parallel 01","Day3_Time_Slot4",3,4,"Parallel 01",{"$f":"VLOOKUP($D$1&D5,'2020_Virtual_Forum'!A:F,6,FALSE)","v":"2020-10-21T07:00:00"},{"$f":"VLOOKUP($D$1&D5&$E$1&E5,'2020_Virtual_Forum'!A:F,5,FALSE)","v":"15:30 - 16:45 PM (UTC)"},{"$f":"HLOOKUP($F5,'2020_Virtual_Forum'!$H$5:$Q$7,2,FALSE)","v":"Session 1"},{"$f":"HLOOKUP($F5,'2020_Virtual_Forum'!$H$5:$Q$7,3,FALSE)","v":0},"Y","NA",3,{"$f":"IF(K5=\"NA\",\"NA\",IF(K5=\"Y\",COUNTIF($M$1:M4,M5)+1,COUNTIF($M$1:M4,M5)+1))","v":1},"TA3.01","Leaving no one behind in data for Covid-19 and the 2030 Agenda"]
[131,"Day3_Time_SlotC_Parallel 01","Day3_Time_SlotC",3,"C","Parallel 01",{"$f":"VLOOKUP($D$1&D6,'2020_Virtual_Forum'!A:F,6,FALSE)","v":"2020-10-21T07:00:00"},{"$f":"VLOOKUP($D$1&D6&$E$1&E6,'2020_Virtual_Forum'!A:F,5,FALSE)","v":"17:00 - 18:00 PM (UTC)"},{"$f":"HLOOKUP($F6,'2020_Virtual_Forum'!$H$5:$Q$7,2,FALSE)","v":"Session 1"},{"$f":"HLOOKUP($F6,'2020_Virtual_Forum'!$H$5:$Q$7,3,FALSE)","v":0},"Y","NA","_C",{"$f":"IF(K6=\"NA\",\"NA\",IF(K6=\"Y\",COUNTIF($M$1:M5,M6)+1,COUNTIF($M$1:M5,M6)+1))","v":1},"TA_C.01","Closing session"]
[12,"Day1_Time_Slot1_Parallel 02","Day1_Time_Slot1",1,1,"Parallel 02",{"$f":"VLOOKUP($D$1&D7,'2020_Virtual_Forum'!A:F,6,FALSE)","v":"2020-10-19T06:30:00"},{"$f":"VLOOKUP($D$1&D7&$E$1&E7,'2020_Virtual_Forum'!A:F,5,FALSE)","v":"11:00 - 12:15 PM (UTC)"},{"$f":"HLOOKUP($F7,'2020_Virtual_Forum'!$H$5:$Q$7,2,FALSE)","v":"Session 2"},{"$f":"HLOOKUP($F7,'2020_Virtual_Forum'!$H$5:$Q$7,3,FALSE)","v":0},"NA","NA","NA",{"$f":"IF(K7=\"NA\",\"NA\",IF(K7=\"Y\",COUNTIF($M$1:M6,M7)+1,COUNTIF($M$1:M6,M7)+1))","v":"NA"},"NA","NA"]
[13,"Day1_Time_Slot1_Parallel 03","Day1_Time_Slot1",1,1,"Parallel 03",{"$f":"VLOOKUP($D$1&D8,'2020_Virtual_Forum'!A:F,6,FALSE)","v":"2020-10-19T06:30:00"},{"$f":"VLOOKUP($D$1&D8&$E$1&E8,'2020_Virtual_Forum'!A:F,5,FALSE)","v":"11:00 - 12:15 PM (UTC)"},{"$f":"HLOOKUP($F8,'2020_Virtual_Forum'!$H$5:$Q$7,2,FALSE)","v":"Session 3"},{"$f":"HLOOKUP($F8,'2020_Virtual_Forum'!$H$5:$Q$7,3,FALSE)","v":0},"NA","NA","NA",{"$f":"IF(K8=\"NA\",\"NA\",IF(K8=\"Y\",COUNTIF($M$1:M7,M8)+1,COUNTIF($M$1:M7,M8)+1))","v":"NA"},"NA","NA"]
[14,"Day1_Time_Slot1_Parallel 04","Day1_Time_Slot1",1,1,"Parallel 04",{"$f":"VLOOKUP($D$1&D9,'2020_Virtual_Forum'!A:F,6,FALSE)","v":"2020-10-19T06:30:00"},{"$f":"VLOOKUP($D$1&D9&$E$1&E9,'2020_Virtual_Forum'!A:F,5,FALSE)","v":"11:00 - 12:15 PM (UTC)"},{"$f":"HLOOKUP($F9,'2020_Virtual_Forum'!$H$5:$Q$7,2,FALSE)","v":"Session 4"},{"$f":"HLOOKUP($F9,'2020_Virtual_Forum'!$H$5:$Q$7,3,FALSE)","v":0},"NA","NA","NA",{"$f":"IF(K9=\"NA\",\"NA\",IF(K9=\"Y\",COUNTIF($M$1:M8,M9)+1,COUNTIF($M$1:M8,M9)+1))","v":"NA"},"NA","NA"]
[15,"Day1_Time_Slot1_Parallel 05","Day1_Time_Slot1",1,1,"Parallel 05",{"$f":"VLOOKUP($D$1&D10,'2020_Virtual_Forum'!A:F,6,FALSE)","v":"2020-10-19T06:30:00"},{"$f":"VLOOKUP($D$1&D10&$E$1&E10,'2020_Virtual_Forum'!A:F,5,FALSE)","v":"11:00 - 12:15 PM (UTC)"},{"$f":"HLOOKUP($F10,'2020_Virtual_Forum'!$H$5:$Q$7,2,FALSE)","v":"Session 5"},{"$f":"HLOOKUP($F10,'2020_Virtual_Forum'!$H$5:$Q$7,3,FALSE)","v":0},"NA","NA","NA","NA","NA","Empty"]
[16,"Day1_Time_Slot1_Parallel 06","Day1_Time_Slot1",1,1,"Parallel 06",{"$f":"VLOOKUP($D$1&D11,'2020_Virtual_Forum'!A:F,6,FALSE)","v":"2020-10-19T06:30:00"},{"$f":"VLOOKUP($D$1&D11&$E$1&E11,'2020_Virtual_Forum'!A:F,5,FALSE)","v":"11:00 - 12:15 PM (UTC)"},{"$f":"HLOOKUP($F11,'2020_Virtual_Forum'!$H$5:$Q$7,2,FALSE)","v":"Session 6"},{"$f":"HLOOKUP($F11,'2020_Virtual_Forum'!$H$5:$Q$7,3,FALSE)","v":0},"NA","NA","NA",{"$f":"IF(K11=\"NA\",\"NA\",IF(K11=\"Y\",COUNTIF($M$1:M10,M11)+1,COUNTIF($M$1:M10,M11)+1))","v":"NA"},"NA","NA"]
[17,"Day1_Time_Slot1_Parallel 07","Day1_Time_Slot1",1,1,"Parallel 07",{"$f":"VLOOKUP($D$1&D12,'2020_Virtual_Forum'!A:F,6,FALSE)","v":"2020-10-19T06:30:00"},{"$f":"VLOOKUP($D$1&D12&$E$1&E12,'2020_Virtual_Forum'!A:F,5,FALSE)","v":"11:00 - 12:15 PM (UTC)"},{"$f":"HLOOKUP($F12,'2020_Virtual_Forum'!$H$5:$Q$7,2,FALSE)","v":"Session 7"},{"$f":"HLOOKUP($F12,'2020_Virtual_Forum'!$H$5:$Q$7,3,FALSE)","v":0},"NA","NA","NA",{"$f":"IF(K12=\"NA\",\"NA\",IF(K12=\"Y\",COUNTIF($M$1:M11,M12)+1,COUNTIF($M$1:M11,M12)+1))","v":"NA"},"NA","NA"]
[18,"Day1_Time_Slot1_Parallel 08","Day1_Time_Slot1",1,1,"Parallel 08",{"$f":"VLOOKUP($D$1&D13,'2020_Virtual_Forum'!A:F,6,FALSE)","v":"2020-10-19T06:30:00"},{"$f":"VLOOKUP($D$1&D13&$E$1&E13,'2020_Virtual_Forum'!A:F,5,FALSE)","v":"11:00 - 12:15 PM (UTC)"},{"$f":"HLOOKUP($F13,'2020_Virtual_Forum'!$H$5:$Q$7,2,FALSE)","v":"Session 8"},{"$f":"HLOOKUP($F13,'2020_Virtual_Forum'!$H$5:$Q$7,3,FALSE)","v":0},"NA","NA","NA",{"$f":"IF(K13=\"NA\",\"NA\",IF(K13=\"Y\",COUNTIF($M$1:M12,M13)+1,COUNTIF($M$1:M12,M13)+1))","v":"NA"},"NA","NA"]
[19,"Day1_Time_Slot1_Parallel 09","Day1_Time_Slot1",1,1,"Parallel 09",{"$f":"VLOOKUP($D$1&D14,'2020_Virtual_Forum'!A:F,6,FALSE)","v":"2020-10-19T06:30:00"},{"$f":"VLOOKUP($D$1&D14&$E$1&E14,'2020_Virtual_Forum'!A:F,5,FALSE)","v":"11:00 - 12:15 PM (UTC)"},{"$f":"HLOOKUP($F14,'2020_Virtual_Forum'!$H$5:$Q$7,2,FALSE)","v":"Session 9"},{"$f":"HLOOKUP($F14,'2020_Virtual_Forum'!$H$5:$Q$7,3,FALSE)","v":0},"NA","NA","NA",{"$f":"IF(K14=\"NA\",\"NA\",IF(K14=\"Y\",COUNTIF($M$1:M13,M14)+1,COUNTIF($M$1:M13,M14)+1))","v":"NA"},"NA","NA"]
[20,"Day1_Time_Slot1_Parallel 10","Day1_Time_Slot1",1,1,"Parallel 10",{"$f":"VLOOKUP($D$1&D15,'2020_Virtual_Forum'!A:F,6,FALSE)","v":"2020-10-19T06:30:00"},{"$f":"VLOOKUP($D$1&D15&$E$1&E15,'2020_Virtual_Forum'!A:F,5,FALSE)","v":"11:00 - 12:15 PM (UTC)"},{"$f":"HLOOKUP($F15,'2020_Virtual_Forum'!$H$5:$Q$7,2,FALSE)","v":"Session 10"},{"$f":"HLOOKUP($F15,'2020_Virtual_Forum'!$H$5:$Q$7,3,FALSE)","v":0},"NA","NA","NA",{"$f":"IF(K15=\"NA\",\"NA\",IF(K15=\"Y\",COUNTIF($M$1:M14,M15)+1,COUNTIF($M$1:M14,M15)+1))","v":"NA"},"NA","NA"]
[24,"Day1_Time_Slot2_Parallel 04","Day1_Time_Slot2",1,2,"Parallel 04",{"$f":"VLOOKUP($D$1&D16,'2020_Virtual_Forum'!A:F,6,FALSE)","v":"2020-10-19T06:30:00"},{"$f":"VLOOKUP($D$1&D16&$E$1&E16,'2020_Virtual_Forum'!A:F,5,FALSE)","v":"12:30 - 13:45 PM (UTC)"},{"$f":"HLOOKUP($F16,'2020_Virtual_Forum'!$H$5:$Q$7,2,FALSE)","v":"Session 4"},{"$f":"HLOOKUP($F16,'2020_Virtual_Forum'!$H$5:$Q$7,3,FALSE)","v":0},"NA","NA","NA",{"$f":"IF(K16=\"NA\",\"NA\",IF(K16=\"Y\",COUNTIF($M$1:M15,M16)+1,COUNTIF($M$1:M15,M16)+1))","v":"NA"},"NA","Empty"]
[25,"Day1_Time_Slot2_Parallel 05","Day1_Time_Slot2",1,2,"Parallel 05",{"$f":"VLOOKUP($D$1&D17,'2020_Virtual_Forum'!A:F,6,FALSE)","v":"2020-10-19T06:30:00"},{"$f":"VLOOKUP($D$1&D17&$E$1&E17,'2020_Virtual_Forum'!A:F,5,FALSE)","v":"12:30 - 13:45 PM (UTC)"},{"$f":"HLOOKUP($F17,'2020_Virtual_Forum'!$H$5:$Q$7,2,FALSE)","v":"Session 5"},{"$f":"HLOOKUP($F17,'2020_Virtual_Forum'!$H$5:$Q$7,3,FALSE)","v":0},"NA","NA","NA","NA","NA","Empty"]
[26,"Day1_Time_Slot2_Parallel 06","Day1_Time_Slot2",1,2,"Parallel 06",{"$f":"VLOOKUP($D$1&D18,'2020_Virtual_Forum'!A:F,6,FALSE)","v":"2020-10-19T06:30:00"},{"$f":"VLOOKUP($D$1&D18&$E$1&E18,'2020_Virtual_Forum'!A:F,5,FALSE)","v":"12:30 - 13:45 PM (UTC)"},{"$f":"HLOOKUP($F18,'2020_Virtual_Forum'!$H$5:$Q$7,2,FALSE)","v":"Session 6"},{"$f":"HLOOKUP($F18,'2020_Virtual_Forum'!$H$5:$Q$7,3,FALSE)","v":0},"NA","NA","NA",{"$f":"IF(K18=\"NA\",\"NA\",IF(K18=\"Y\",COUNTIF($M$1:M17,M18)+1,COUNTIF($M$1:M17,M18)+1))","v":"NA"},"NA","TBC"]
[27,"Day1_Time_Slot2_Parallel 07","Day1_Time_Slot2",1,2,"Parallel 07",{"$f":"VLOOKUP($D$1&D19,'2020_Virtual_Forum'!A:F,6,FALSE)","v":"2020-10-19T06:30:00"},{"$f":"VLOOKUP($D$1&D19&$E$1&E19,'2020_Virtual_Forum'!A:F,5,FALSE)","v":"12:30 - 13:45 PM (UTC)"},{"$f":"HLOOKUP($F19,'2020_Virtual_Forum'!$H$5:$Q$7,2,FALSE)","v":"Session 7"},{"$f":"HLOOKUP($F19,'2020_Virtual_Forum'!$H$5:$Q$7,3,FALSE)","v":0},"NA","NA","NA",{"$f":"IF(K19=\"NA\",\"NA\",IF(K19=\"Y\",COUNTIF($M$1:M18,M19)+1,COUNTIF($M$1:M18,M19)+1))","v":"NA"},"NA","TBC"]
[28,"Day1_Time_Slot2_Parallel 08","Day1_Time_Slot2",1,2,"Parallel 08",{"$f":"VLOOKUP($D$1&D20,'2020_Virtual_Forum'!A:F,6,FALSE)","v":"2020-10-19T06:30:00"},{"$f":"VLOOKUP($D$1&D20&$E$1&E20,'2020_Virtual_Forum'!A:F,5,FALSE)","v":"12:30 - 13:45 PM (UTC)"},{"$f":"HLOOKUP($F20,'2020_Virtual_Forum'!$H$5:$Q$7,2,FALSE)","v":"Session 8"},{"$f":"HLOOKUP($F20,'2020_Virtual_Forum'!$H$5:$Q$7,3,FALSE)","v":0},"NA","NA","NA",{"$f":"IF(K20=\"NA\",\"NA\",IF(K20=\"Y\",COUNTIF($M$1:M19,M20)+1,COUNTIF($M$1:M19,M20)+1))","v":"NA"},"NA","TBC"]
{"$rows_left_out":138}