{"text_format":"1","workbook":"xlsx","n_sheets":2,"sheets":["UNWDF_Hangzhou_2023","UNWDF2023_LookUp"],"not_rendered":{"charts":0,"images":1,"macros":1,"external_links":3,"defined_names":52,"comments":0,"pivot_tables":0},"unopened":[],"bounds":{"document_bytes":16777216,"sheet_cells":100000,"rows_first":2000,"rows_last":500,"rows_between":2000,"halvings":0,"cell_chars":16384,"cell_head_chars":4096},"cells_cut":0,"cells_raw":0,"read":"whole","date_system":"1900"}

{"sheet":"UNWDF_Hangzhou_2023","index":0,"n_rows":130,"n_cols":19,"rows_kept":130,"cut":false,"hidden":false,"merged":[[89,5,89,18],[129,5,129,18],[108,6,108,18],[113,6,113,18],[118,6,118,18],[90,5,90,18],[109,5,112,5],[104,5,107,5],[94,5,97,5],[99,5,102,5],[114,5,117,5],[92,5,93,5],[119,5,120,5],[122,5,123,5],[98,6,98,18],[125,10,125,12],[24,6,24,18],[29,6,29,18],[34,6,34,18],[39,6,39,18],[61,6,61,18],[48,10,48,12],[48,14,48,16],[50,10,50,12],[50,14,50,16],[53,5,53,18],[44,6,44,15],[57,5,60,5],[35,5,38,5],[52,5,52,18],[0,5,0,18],[1,5,1,18],[2,5,2,18],[3,5,3,18],[12,5,12,18],[5,5,6,5],[10,5,11,5],[7,5,8,5],[9,6,9,18],[85,10,85,12],[85,14,85,16],[87,10,87,12],[87,14,87,16],[81,6,81,15],[127,10,127,12],[127,14,127,16],[125,14,125,16],[103,6,103,18],[121,6,121,15],[14,5,15,5],[30,5,33,5],[20,5,23,5],[16,5,19,5],[25,5,28,5],[66,6,66,18],[82,5,83,5],[40,5,43,5],[45,5,46,5],[77,5,80,5],[55,5,56,5],[62,5,65,5],[67,5,70,5],[72,5,75,5],[71,6,71,18],[76,6,76,18]]}
[null,null,null,"Day",24,"UNITED NATIONS WORLD DATA FORUM 2023 (24 - 27 APRIL)"]
[null,"NOW (Local time)",{"$f":"NOW()","v":"2023-05-01T12:39:05.050"},"Month",4,"Hangzhou International Expo Centre, Hangzhou, China"]
[null,"GMT+8/UTC+8 (Hangzhou time)",{"$f":"Local2GMT(NOW())+(8/24)","v":{"$error":"#NAME?"}},"Year",2023,"FINAL Programme, as of 28 April 2023"]
["Day0",null,null,null,{"$f":"DATE($E$3,$E$2,$E$1+MID(B8,4,1))","v":"2023-04-24"},{"$f":"IF(ISERROR(DATE($E$3,$E$2,$E$1+MID(B8,4,1))+TIME(MID(E8,1,2),MID(E8,4,2),0)+($C$2-$C$3)),DATE($E$3,$E$2,$E$1+MID(B8,4,1)),TEXT(DATE($E$3,$E$2,$E$1+MID(B8,4,1))+TIME(MID(E8,1,2),MID(E8,4,2),0)+($C$2-$C$3),\"DDDDDD, DD MMMM YYYY\")&\" [Date changes shown on row]\")","v":"2023-04-24"}]
[null,null,"LookUp",null,null,null,"LookUp","Parallel 01","Parallel 02","Parallel 03","Parallel 04","Parallel 05","Parallel 06","Parallel 07","Parallel 08","Parallel 09","Parallel 10","Parallel 11","Parallel 12"]
[null,null,null,null,null,"Time (Auto-adjusts to your local time, unless \"(Hangzhou time)\" shown)","Rm Name","Room 01","Room 02","Room 03","Room 04","Room 05","Room 06","Room 07","Room 08","Room 09","LEARNING LABS 1","LEARNING LABS 2","DEMOS SPACE"]
["DayTime_LookUp","Day_LookUp","Time_LookUp","Col_LookUp","Time (GMT/UTC time+8)",null,"Capacity",2000,200,200,200,200,200,100,100,100,100,100,100]
[{"$f":"B8&C8","v":"Day0Time_Slot1"},"Day0","Time_Slot1",16,"10:00 - 11:00 (Hangzhou Time)",{"$f":"IF(ISERROR(TEXT((DATE($E$3,$E$2,$E$1+MID(B8,4,1))+TIME(MID(E8,1,2),MID(E8,4,2),0))+($C$2-$C$3),\"H:MM AM/PM\")&\" - \"&TEXT(DATE($E$3,$E$2,$E$1+MID(B8,4,1))+TIME(MID(E8,9,2),MID(E8,12,2),0)+($C$2-$C$3),\"H:MM AM/PM\")),E8,TEXT(DATE($E$3,$E$2,$E$1+MID(B8,4,1))+TIME(MID(E8,1,2),MID(E8,4,2),0)+($C$2-$C$3),\"DDDD DD MMM\")&\" : \"&TEXT((DATE($E$3,$E$2,$E$1+MID(B8,4,1))+TIME(MID(E8,1,2),MID(E8,4,2),0))+($C$2-$C$3),\"H:MM AM/PM\")&\" - \"&TEXT(DATE($E$3,$E$2,$E$1+MID(B8,4,1))+TIME(MID(E8,9,2),MID(E8,12,2),0)+($C$2-$C$3),\"H:MM AM/PM\"))","v":"10:00 - 11:00 (Hangzhou Time)"},"Event Title",{"$f":"IF(VLOOKUP($B8&\"_\"&$C8&\"_\"&H$14,UNWDF2023_LookUp!$B:$R,$D8,FALSE)=0,\"\",VLOOKUP($B8&\"_\"&$C8&\"_\"&H$14,UNWDF2023_LookUp!$B:$R,$D8,FALSE))","v":"Opening press conference (LOCATION: MEDIA AREA)"}]
["Day0Time_Slot1","Day0","Time_Slot1",17,"",null,"Organiser",{"$f":"IF(VLOOKUP($B9&\"_\"&$C9&\"_\"&H$14,UNWDF2023_LookUp!$B:$R,$D9,FALSE)=0,\"\",VLOOKUP($B9&\"_\"&$C9&\"_\"&H$14,UNWDF2023_LookUp!$B:$R,$D9,FALSE))","v":"National Bureau of Statistics (NBS-China); United Nations Statistics Division (UNSD-DESA)"}]
[null,"Day0",null,null,"11:00 - 15:30 (Hangzhou time)",{"$f":"IF(ISERROR(TEXT((DATE($E$3,$E$2,$E$1+MID(B10,4,1))+TIME(MID(E10,1,2),MID(E10,4,2),0))+($C$2-$C$3),\"H:MM AM/PM\")&\" - \"&TEXT(DATE($E$3,$E$2,$E$1+MID(B10,4,1))+TIME(MID(E10,9,2),MID(E10,12,2),0)+($C$2-$C$3),\"H:MM AM/PM\")),E10,TEXT((DATE($E$3,$E$2,$E$1+MID(B10,4,1))+TIME(MID(E10,1,2),MID(E10,4,2),0))+($C$2-$C$3),\"H:MM AM/PM\")&\" - \"&TEXT(DATE($E$3,$E$2,$E$1+MID(B10,4,1))+TIME(MID(E10,9,2),MID(E10,12,2),0)+($C$2-$C$3),\"H:MM AM/PM\"))","v":"11:00 - 15:30 (Hangzhou time)"},"Break"]
[{"$f":"B11&C11","v":"Day0Time_Slot2"},"Day0","Time_Slot2",16,"15:30 - 16:15 (Hangzhou Time)",{"$f":"IF(ISERROR(TEXT((DATE($E$3,$E$2,$E$1+MID(B11,4,1))+TIME(MID(E11,1,2),MID(E11,4,2),0))+($C$2-$C$3),\"H:MM AM/PM\")&\" - \"&TEXT(DATE($E$3,$E$2,$E$1+MID(B11,4,1))+TIME(MID(E11,9,2),MID(E11,12,2),0)+($C$2-$C$3),\"H:MM AM/PM\")),E11,TEXT(DATE($E$3,$E$2,$E$1+MID(B11,4,1))+TIME(MID(E11,1,2),MID(E11,4,2),0)+($C$2-$C$3),\"DDDD DD MMM\")&\" : \"&TEXT((DATE($E$3,$E$2,$E$1+MID(B11,4,1))+TIME(MID(E11,1,2),MID(E11,4,2),0))+($C$2-$C$3),\"H:MM AM/PM\")&\" - \"&TEXT(DATE($E$3,$E$2,$E$1+MID(B11,4,1))+TIME(MID(E11,9,2),MID(E11,12,2),0)+($C$2-$C$3),\"H:MM AM/PM\"))","v":"15:30 - 16:15 (Hangzhou Time)"},"Event Title",{"$f":"IF(VLOOKUP($B11&\"_\"&$C11&\"_\"&H$14,UNWDF2023_LookUp!$B:$R,$D11,FALSE)=0,\"\",VLOOKUP($B11&\"_\"&$C11&\"_\"&H$14,UNWDF2023_LookUp!$B:$R,$D11,FALSE))","v":"Opening ceremony"}]
["Day0Time_Slot2","Day0","Time_Slot2",17,"",null,"Organiser",{"$f":"IF(VLOOKUP($B12&\"_\"&$C12&\"_\"&H$14,UNWDF2023_LookUp!$B:$R,$D12,FALSE)=0,\"\",VLOOKUP($B12&\"_\"&$C12&\"_\"&H$14,UNWDF2023_LookUp!$B:$R,$D12,FALSE))","v":"National Bureau of Statistics (NBS-China)"}]
["Day1",null,null,null,{"$f":"DATE($E$3,$E$2,$E$1+MID(B17,4,1))","v":"2023-04-25"},{"$f":"IF(ISERROR(DATE($E$3,$E$2,$E$1+MID(B17,4,1))+TIME(MID(E17,1,2),MID(E17,4,2),0)+($C$2-$C$3)),DATE($E$3,$E$2,$E$1+MID(B17,4,1)),TEXT(DATE($E$3,$E$2,$E$1+MID(B17,4,1))+TIME(MID(E17,1,2),MID(E17,4,2),0)+($C$2-$C$3),\"DDDDDD, DD MMMM YYYY\")&\" [Date changes shown on row]\")","v":"2023-04-25"}]
[null,null,"LookUp",null,null,null,"LookUp","Parallel 01","Parallel 02","Parallel 03","Parallel 04","Parallel 05","Parallel 06","Parallel 07","Parallel 08","Parallel 09","Parallel 10","Parallel 11","Parallel 12"]
[null,null,null,null,null,"Time (Auto-adjusts to your local time, unless \"(Hangzhou time)\" shown)","Rm Name","Room 01","Room 02","Room 03","Room 04","Room 05","Room 06","Room 07","Room 08","Room 09","LEARNING LABS 1","LEARNING LABS 2","DEMOS SPACE"]
["DayTime_LookUp","Day_LookUp","Time_LookUp","Col_LookUp","Time (GMT/UTC time+8)",null,"Capacity",2000,200,200,200,200,200,100,100,100,100,100,100]
[{"$f":"B17&C17","v":"Day1Time_Slot1"},"Day1","Time_Slot1",15,"08:45 - 08:55 (Hangzhou time)",{"$f":"IF(ISERROR(TEXT((DATE($E$3,$E$2,$E$1+MID(B17,4,1))+TIME(MID(E17,1,2),MID(E17,4,2),0))+($C$2-$C$3),\"H:MM AM/PM\")&\" - \"&TEXT(DATE($E$3,$E$2,$E$1+MID(B17,4,1))+TIME(MID(E17,9,2),MID(E17,12,2),0)+($C$2-$C$3),\"H:MM AM/PM\")),E17,TEXT(DATE($E$3,$E$2,$E$1+MID(B17,4,1))+TIME(MID(E17,1,2),MID(E17,4,2),0)+($C$2-$C$3),\"DDDD DD MMM\")&\" : \"&TEXT((DATE($E$3,$E$2,$E$1+MID(B17,4,1))+TIME(MID(E17,1,2),MID(E17,4,2),0))+($C$2-$C$3),\"H:MM AM/PM\")&\" - \"&TEXT(DATE($E$3,$E$2,$E$1+MID(B17,4,1))+TIME(MID(E17,9,2),MID(E17,12,2),0)+($C$2-$C$3),\"H:MM AM/PM\"))","v":"08:45 - 08:55 (Hangzhou time)"},"Event_ID",{"$f":"IF(VLOOKUP($B17&\"_\"&$C17&\"_\"&H$14,UNWDF2023_LookUp!$B:$R,$D17,FALSE)=0,\"\",VLOOKUP($B17&\"_\"&$C17&\"_\"&H$14,UNWDF2023_LookUp!$B:$R,$D17,FALSE))","v":"TA_O.03"}]
["Day1Time_Slot1","Day1","Time_Slot1",13,"",null,"Thematic Area",{"$f":"IF(VLOOKUP($B18&\"_\"&$C18&\"_\"&H$14,UNWDF2023_LookUp!$B:$R,$D18,FALSE)=0,\"\",VLOOKUP($B18&\"_\"&$C18&\"_\"&H$14,UNWDF2023_LookUp!$B:$R,$D18,FALSE))","v":"_O"}]
[{"$f":"B19&C19","v":"Day1Time_Slot1"},"Day1","Time_Slot1",16,"",null,"Event Title",{"$f":"IF(VLOOKUP($B19&\"_\"&$C19&\"_\"&H$14,UNWDF2023_LookUp!$B:$R,$D19,FALSE)=0,\"\",VLOOKUP($B19&\"_\"&$C19&\"_\"&H$14,UNWDF2023_LookUp!$B:$R,$D19,FALSE))","v":"Welcome and introduction"}]
["Day1Time_Slot1","Day1","Time_Slot1",17,"",null,"Organiser",{"$f":"IF(VLOOKUP($B20&\"_\"&$C20&\"_\"&H$14,UNWDF2023_LookUp!$B:$R,$D20,FALSE)=0,\"\",VLOOKUP($B20&\"_\"&$C20&\"_\"&H$14,UNWDF2023_LookUp!$B:$R,$D20,FALSE))","v":"National Bureau of Statistics (NBS-China) / United Nations Statistics Division (UNSD-DESA)"}]
{"$rows_left_out":111}
{"sheet":"UNWDF2023_LookUp","index":1,"n_rows":245,"n_cols":33,"rows_kept":245,"cut":false,"hidden":true,"merged":[]}
["ID","LookUp","Day/Time","Day","Time_Slot","Location","Date","Time","Duration","Room_Name","Room_Capacity","UNWDF2023_Plenary","UNWDF2023_ProposalID","UNWDF2023_TA","UNWDF2023_Session","UNWDF2023_ProgrammeID","UNWDF2023_SessionTitle","UNWDF2023_SessionOrg","LookUp","Comment"]
[1,{"$f":"C2&\"_\"&F2","v":"Day0_Time_Slot1_Parallel 01"},{"$f":"$D$1&D2&\"_\"&$E$1&E2","v":"Day0_Time_Slot1"},0,1,"Parallel 01",{"$f":"VLOOKUP($D$1&D2,UNWDF_Hangzhou_2023!A:F,5,FALSE)","v":"2023-04-24"},{"$f":"MID(VLOOKUP($D$1&D2&$E$1&E2,UNWDF_Hangzhou_2023!A:F,5,FALSE),1,SEARCH(\"(\",VLOOKUP($D$1&D2&$E$1&E2,UNWDF_Hangzhou_2023!A:F,5,FALSE))-2)","v":"10:00 - 11:00"},{"$f":"TEXT(MID(H2,SEARCH(\"-\",H2)+2,LEN(H2)-SEARCH(\"-\",H2)-1)-MID(H2,1,SEARCH(\"-\",H2)-1),\"h:mm\")","v":"1:00"},{"$f":"HLOOKUP($F2,UNWDF_Hangzhou_2023!$H$14:$S$16,2,FALSE)","v":"Room 01"},{"$f":"HLOOKUP($F2,UNWDF_Hangzhou_2023!$H$14:$S$16,3,FALSE)","v":2000},"Y","NA","_P",{"$f":"IF(OR(L2=\"NA\",L2=\"E\"),\"NA\",IF(L2=\"Y\",COUNTIF($M$1:N1,N2)+1,COUNTIF($M$1:N1,N2)+1))","v":1},{"$f":"IF(N2=\"NA\",\"NA\",\"TA\"&N2&\".\"&TEXT(O2,\"0#\"))","v":"TA_P.01"},"Opening press conference (LOCATION: MEDIA AREA)","National Bureau of Statistics (NBS-China); United Nations Statistics Division (UNSD-DESA)",{"$f":"B2","v":"Day0_Time_Slot1_Parallel 01"}]
[2,"Day0_Time_Slot2_Parallel 01","Day0_Time_Slot2",0,2,"Parallel 01",{"$f":"VLOOKUP($D$1&D3,UNWDF_Hangzhou_2023!A:F,5,FALSE)","v":"2023-04-24"},{"$f":"MID(VLOOKUP($D$1&D3&$E$1&E3,UNWDF_Hangzhou_2023!A:F,5,FALSE),1,SEARCH(\"(\",VLOOKUP($D$1&D3&$E$1&E3,UNWDF_Hangzhou_2023!A:F,5,FALSE))-2)","v":"15:30 - 16:15"},{"$f":"TEXT(MID(H3,SEARCH(\"-\",H3)+2,LEN(H3)-SEARCH(\"-\",H3)-1)-MID(H3,1,SEARCH(\"-\",H3)-1),\"h:mm\")","v":"0:45"},{"$f":"HLOOKUP($F3,UNWDF_Hangzhou_2023!$H$14:$S$16,2,FALSE)","v":"Room 01"},{"$f":"HLOOKUP($F3,UNWDF_Hangzhou_2023!$H$14:$S$16,3,FALSE)","v":2000},"Y","NA","_O",{"$f":"IF(OR(L3=\"NA\",L3=\"E\"),\"NA\",IF(L3=\"Y\",COUNTIF($M$1:N2,N3)+1,COUNTIF($M$1:N2,N3)+1))","v":1},"TA_O.01","Opening ceremony","National Bureau of Statistics (NBS-China)","Day0_Time_Slot2_Parallel 01"]
[3,"Day1_Time_Slot1_Parallel 01","Day1_Time_Slot1",1,1,"Parallel 01",{"$f":"VLOOKUP($D$1&D4,UNWDF_Hangzhou_2023!A:F,5,FALSE)","v":"2023-04-25"},{"$f":"MID(VLOOKUP($D$1&D4&$E$1&E4,UNWDF_Hangzhou_2023!A:F,5,FALSE),1,SEARCH(\"(\",VLOOKUP($D$1&D4&$E$1&E4,UNWDF_Hangzhou_2023!A:F,5,FALSE))-2)","v":"08:45 - 08:55"},"0:10",{"$f":"HLOOKUP($F4,UNWDF_Hangzhou_2023!$H$14:$S$16,2,FALSE)","v":"Room 01"},{"$f":"HLOOKUP($F4,UNWDF_Hangzhou_2023!$H$14:$S$16,3,FALSE)","v":2000},"Y","NA","_O",3,"TA_O.03","Welcome and introduction","National Bureau of Statistics (NBS-China) / United Nations Statistics Division (UNSD-DESA)","Day1_Time_Slot1_Parallel 01"]
[4,"Day1_Time_Slot2_Parallel 01","Day1_Time_Slot2",1,2,"Parallel 01",{"$f":"VLOOKUP($D$1&D5,UNWDF_Hangzhou_2023!A:F,5,FALSE)","v":"2023-04-25"},{"$f":"MID(VLOOKUP($D$1&D5&$E$1&E5,UNWDF_Hangzhou_2023!A:F,5,FALSE),1,SEARCH(\"(\",VLOOKUP($D$1&D5&$E$1&E5,UNWDF_Hangzhou_2023!A:F,5,FALSE))-2)","v":"09:00 - 10:30"},"1:30",{"$f":"HLOOKUP($F5,UNWDF_Hangzhou_2023!$H$14:$S$16,2,FALSE)","v":"Room 01"},{"$f":"HLOOKUP($F5,UNWDF_Hangzhou_2023!$H$14:$S$16,3,FALSE)","v":2000},"Y","NA",5,1,"TA5.01","Host country plenary session","National Bureau of Statistics (NBS-China)","Day1_Time_Slot2_Parallel 01",""]
[5,"Day1_Time_Slot6_Parallel 01","Day1_Time_Slot6",1,6,"Parallel 01",{"$f":"VLOOKUP($D$1&D6,UNWDF_Hangzhou_2023!A:F,5,FALSE)","v":"2023-04-25"},{"$f":"MID(VLOOKUP($D$1&D6&$E$1&E6,UNWDF_Hangzhou_2023!A:F,5,FALSE),1,SEARCH(\"(\",VLOOKUP($D$1&D6&$E$1&E6,UNWDF_Hangzhou_2023!A:F,5,FALSE))-2)","v":"16:15 - 17:30"},"1:15",{"$f":"HLOOKUP($F6,UNWDF_Hangzhou_2023!$H$14:$S$16,2,FALSE)","v":"Room 01"},{"$f":"HLOOKUP($F6,UNWDF_Hangzhou_2023!$H$14:$S$16,3,FALSE)","v":2000},"Y","NA",1,{"$f":"IF(OR(L6=\"NA\",L6=\"E\"),\"NA\",IF(L6=\"Y\",COUNTIF($M$1:N5,N6)+1,COUNTIF($M$1:N5,N6)+1))","v":1},"TA1.01","Innovation and partnerships for better and more inclusive data","UN World Data Forum Programme Committee (UNWDF PC)","Day1_Time_Slot6_Parallel 01",""]
[6,"Day1_Time_Slot7_Parallel 01","Day1_Time_Slot7",1,7,"Parallel 01",{"$f":"VLOOKUP($D$1&D7,UNWDF_Hangzhou_2023!A:F,5,FALSE)","v":"2023-04-25"},{"$f":"MID(VLOOKUP($D$1&D7&$E$1&E7,UNWDF_Hangzhou_2023!A:F,5,FALSE),1,SEARCH(\"(\",VLOOKUP($D$1&D7&$E$1&E7,UNWDF_Hangzhou_2023!A:F,5,FALSE))-2)","v":"18:30 - 19:15"},"0:45",{"$f":"HLOOKUP($F7,UNWDF_Hangzhou_2023!$H$14:$S$16,2,FALSE)","v":"Room 01"},{"$f":"HLOOKUP($F7,UNWDF_Hangzhou_2023!$H$14:$S$16,3,FALSE)","v":2000},"Y","NA","_S",{"$f":"IF(OR(L7=\"NA\",L7=\"E\"),\"NA\",IF(L7=\"Y\",COUNTIF($M$1:N6,N7)+1,COUNTIF($M$1:N6,N7)+1))","v":1},"TA_S.01","NA","NA","Day1_Time_Slot7_Parallel 01",""]
[7,"Day2_Time_Slot1_Parallel 01","Day2_Time_Slot1",2,1,"Parallel 01",{"$f":"VLOOKUP($D$1&D8,UNWDF_Hangzhou_2023!A:F,5,FALSE)","v":"2023-04-26"},{"$f":"MID(VLOOKUP($D$1&D8&$E$1&E8,UNWDF_Hangzhou_2023!A:F,5,FALSE),1,SEARCH(\"(\",VLOOKUP($D$1&D8&$E$1&E8,UNWDF_Hangzhou_2023!A:F,5,FALSE))-2)","v":"09:00 - 10:15"},"1:15",{"$f":"HLOOKUP($F8,UNWDF_Hangzhou_2023!$H$14:$S$16,2,FALSE)","v":"Room 01"},{"$f":"HLOOKUP($F8,UNWDF_Hangzhou_2023!$H$14:$S$16,3,FALSE)","v":2000},"Y","NA",2,{"$f":"IF(OR(L8=\"NA\",L8=\"E\"),\"NA\",IF(L8=\"Y\",COUNTIF($M$1:N7,N8)+1,COUNTIF($M$1:N7,N8)+1))","v":1},"TA2.01","Maximizing the use and value of data for better decision making","UN World Data Forum Programme Committee (UNWDF PC)","Day2_Time_Slot1_Parallel 01",""]
[8,"Day2_Time_Slot5_Parallel 01","Day2_Time_Slot5",2,5,"Parallel 01",{"$f":"VLOOKUP($D$1&D9,UNWDF_Hangzhou_2023!A:F,5,FALSE)","v":"2023-04-26"},{"$f":"MID(VLOOKUP($D$1&D9&$E$1&E9,UNWDF_Hangzhou_2023!A:F,5,FALSE),1,SEARCH(\"(\",VLOOKUP($D$1&D9&$E$1&E9,UNWDF_Hangzhou_2023!A:F,5,FALSE))-2)","v":"16:15 - 17:30"},"1:15",{"$f":"HLOOKUP($F9,UNWDF_Hangzhou_2023!$H$14:$S$16,2,FALSE)","v":"Room 01"},{"$f":"HLOOKUP($F9,UNWDF_Hangzhou_2023!$H$14:$S$16,3,FALSE)","v":2000},"Y","NA",3,{"$f":"IF(OR(L9=\"NA\",L9=\"E\"),\"NA\",IF(L9=\"Y\",COUNTIF($M$1:N8,N9)+1,COUNTIF($M$1:N8,N9)+1))","v":1},"TA3.01","Building trust and ethics in data","UN World Data Forum Programme Committee (UNWDF PC)","Day2_Time_Slot5_Parallel 01",""]
[9,"Day2_Time_Slot6_Parallel 01","Day2_Time_Slot6",2,6,"Parallel 01",{"$f":"VLOOKUP($D$1&D10,UNWDF_Hangzhou_2023!A:F,5,FALSE)","v":"2023-04-26"},{"$f":"MID(VLOOKUP($D$1&D10&$E$1&E10,UNWDF_Hangzhou_2023!A:F,5,FALSE),1,SEARCH(\"(\",VLOOKUP($D$1&D10&$E$1&E10,UNWDF_Hangzhou_2023!A:F,5,FALSE))-2)","v":"19:30 - 23:59"},"4:29",{"$f":"HLOOKUP($F10,UNWDF_Hangzhou_2023!$H$14:$S$16,2,FALSE)","v":"Room 01"},{"$f":"HLOOKUP($F10,UNWDF_Hangzhou_2023!$H$14:$S$16,3,FALSE)","v":2000},"Y","NA","_S",{"$f":"IF(OR(L10=\"NA\",L10=\"E\"),\"NA\",IF(L10=\"Y\",COUNTIF($M$1:N9,N10)+1,COUNTIF($M$1:N9,N10)+1))","v":2},"TA_S.02","NA","NA","Day2_Time_Slot6_Parallel 01",""]
[10,"Day3_Time_Slot1_Parallel 01","Day3_Time_Slot1",3,1,"Parallel 01",{"$f":"VLOOKUP($D$1&D11,UNWDF_Hangzhou_2023!A:F,5,FALSE)","v":"2023-04-27"},{"$f":"MID(VLOOKUP($D$1&D11&$E$1&E11,UNWDF_Hangzhou_2023!A:F,5,FALSE),1,SEARCH(\"(\",VLOOKUP($D$1&D11&$E$1&E11,UNWDF_Hangzhou_2023!A:F,5,FALSE))-2)","v":"09:00 - 10:15"},"1:15",{"$f":"HLOOKUP($F11,UNWDF_Hangzhou_2023!$H$14:$S$16,2,FALSE)","v":"Room 01"},{"$f":"HLOOKUP($F11,UNWDF_Hangzhou_2023!$H$14:$S$16,3,FALSE)","v":2000},"Y","NA",6,{"$f":"IF(OR(L11=\"NA\",L11=\"E\"),\"NA\",IF(L11=\"Y\",COUNTIF($M$1:N10,N11)+1,COUNTIF($M$1:N10,N11)+1))","v":1},"TA6.01","Programme Committee plenary","UN World Data Forum Programme Committee (UNWDF PC)","Day3_Time_Slot1_Parallel 01",""]
[11,"Day3_Time_Slot5_Parallel 01","Day3_Time_Slot5",3,5,"Parallel 01",{"$f":"VLOOKUP($D$1&D12,UNWDF_Hangzhou_2023!A:F,5,FALSE)","v":"2023-04-27"},{"$f":"MID(VLOOKUP($D$1&D12&$E$1&E12,UNWDF_Hangzhou_2023!A:F,5,FALSE),1,SEARCH(\"(\",VLOOKUP($D$1&D12&$E$1&E12,UNWDF_Hangzhou_2023!A:F,5,FALSE))-2)","v":"15:45 - 17:00"},"1:15",{"$f":"HLOOKUP($F12,UNWDF_Hangzhou_2023!$H$14:$S$16,2,FALSE)","v":"Room 01"},{"$f":"HLOOKUP($F12,UNWDF_Hangzhou_2023!$H$14:$S$16,3,FALSE)","v":2000},"Y","NA",4,{"$f":"IF(OR(L12=\"NA\",L12=\"E\"),\"NA\",IF(L12=\"Y\",COUNTIF($M$1:N11,N12)+1,COUNTIF($M$1:N11,N12)+1))","v":1},"TA4.01","Emerging trends and partnerships to develop the data ecosystem","UN World Data Forum Programme Committee (UNWDF PC)","Day3_Time_Slot5_Parallel 01",""]
[12,"Day3_Time_Slot6_Parallel 01","Day3_Time_Slot6",3,6,"Parallel 01",{"$f":"VLOOKUP($D$1&D13,UNWDF_Hangzhou_2023!A:F,5,FALSE)","v":"2023-04-27"},{"$f":"MID(VLOOKUP($D$1&D13&$E$1&E13,UNWDF_Hangzhou_2023!A:F,5,FALSE),1,SEARCH(\"(\",VLOOKUP($D$1&D13&$E$1&E13,UNWDF_Hangzhou_2023!A:F,5,FALSE))-2)","v":"17:15 - 18:00"},"0:45",{"$f":"HLOOKUP($F13,UNWDF_Hangzhou_2023!$H$14:$S$16,2,FALSE)","v":"Room 01"},{"$f":"HLOOKUP($F13,UNWDF_Hangzhou_2023!$H$14:$S$16,3,FALSE)","v":2000},"Y","NA","_C",{"$f":"IF(OR(L13=\"NA\",L13=\"E\"),\"NA\",IF(L13=\"Y\",COUNTIF($M$1:N12,N13)+1,COUNTIF($M$1:N12,N13)+1))","v":1},"TA_C.01","Closing ceremony","National Bureau of Statistics (NBS-China); United Nations Statistics Division (UNSD-DESA)","Day3_Time_Slot6_Parallel 01",""]
[13,"Day3_Time_Slot7_Parallel 01","Day3_Time_Slot7",3,7,"Parallel 01",{"$f":"VLOOKUP($D$1&D14,UNWDF_Hangzhou_2023!A:F,5,FALSE)","v":"2023-04-27"},{"$f":"MID(VLOOKUP($D$1&D14&$E$1&E14,UNWDF_Hangzhou_2023!A:F,5,FALSE),1,SEARCH(\"(\",VLOOKUP($D$1&D14&$E$1&E14,UNWDF_Hangzhou_2023!A:F,5,FALSE))-2)","v":"17:45 - 19:15"},"1:30",{"$f":"HLOOKUP($F14,UNWDF_Hangzhou_2023!$H$14:$S$16,2,FALSE)","v":"Room 01"},{"$f":"HLOOKUP($F14,UNWDF_Hangzhou_2023!$H$14:$S$16,3,FALSE)","v":2000},"Y","NA","_S",{"$f":"IF(OR(L14=\"NA\",L14=\"E\"),\"NA\",IF(L14=\"Y\",COUNTIF($M$1:N13,N14)+1,COUNTIF($M$1:N13,N14)+1))","v":3},"TA_S.03","NA","NA","Day3_Time_Slot7_Parallel 01",""]
[14,"Day0_Time_Slot1_Parallel 02","Day0_Time_Slot1",0,1,"Parallel 02",{"$f":"VLOOKUP($D$1&D15,UNWDF_Hangzhou_2023!A:F,5,FALSE)","v":"2023-04-24"},{"$f":"MID(VLOOKUP($D$1&D15&$E$1&E15,UNWDF_Hangzhou_2023!A:F,5,FALSE),1,SEARCH(\"(\",VLOOKUP($D$1&D15&$E$1&E15,UNWDF_Hangzhou_2023!A:F,5,FALSE))-2)","v":"10:00 - 11:00"},"1:00",{"$f":"HLOOKUP($F15,UNWDF_Hangzhou_2023!$H$14:$S$16,2,FALSE)","v":"Room 02"},{"$f":"HLOOKUP($F15,UNWDF_Hangzhou_2023!$H$14:$S$16,3,FALSE)","v":200},"NA","NA","NA",{"$f":"IF(OR(L15=\"NA\",L15=\"E\"),\"NA\",IF(L15=\"Y\",COUNTIF($M$1:N14,N15)+1,COUNTIF($M$1:N14,N15)+1))","v":"NA"},"NA","NA","NA","Day0_Time_Slot1_Parallel 02"]
[15,"Day0_Time_Slot1_Parallel 03","Day0_Time_Slot1",0,1,"Parallel 03",{"$f":"VLOOKUP($D$1&D16,UNWDF_Hangzhou_2023!A:F,5,FALSE)","v":"2023-04-24"},{"$f":"MID(VLOOKUP($D$1&D16&$E$1&E16,UNWDF_Hangzhou_2023!A:F,5,FALSE),1,SEARCH(\"(\",VLOOKUP($D$1&D16&$E$1&E16,UNWDF_Hangzhou_2023!A:F,5,FALSE))-2)","v":"10:00 - 11:00"},"1:00",{"$f":"HLOOKUP($F16,UNWDF_Hangzhou_2023!$H$14:$S$16,2,FALSE)","v":"Room 03"},{"$f":"HLOOKUP($F16,UNWDF_Hangzhou_2023!$H$14:$S$16,3,FALSE)","v":200},"NA","NA","NA",{"$f":"IF(OR(L16=\"NA\",L16=\"E\"),\"NA\",IF(L16=\"Y\",COUNTIF($M$1:N15,N16)+1,COUNTIF($M$1:N15,N16)+1))","v":"NA"},"NA","NA","NA","Day0_Time_Slot1_Parallel 03"]
[16,"Day0_Time_Slot1_Parallel 04","Day0_Time_Slot1",0,1,"Parallel 04",{"$f":"VLOOKUP($D$1&D17,UNWDF_Hangzhou_2023!A:F,5,FALSE)","v":"2023-04-24"},{"$f":"MID(VLOOKUP($D$1&D17&$E$1&E17,UNWDF_Hangzhou_2023!A:F,5,FALSE),1,SEARCH(\"(\",VLOOKUP($D$1&D17&$E$1&E17,UNWDF_Hangzhou_2023!A:F,5,FALSE))-2)","v":"10:00 - 11:00"},"1:00",{"$f":"HLOOKUP($F17,UNWDF_Hangzhou_2023!$H$14:$S$16,2,FALSE)","v":"Room 04"},{"$f":"HLOOKUP($F17,UNWDF_Hangzhou_2023!$H$14:$S$16,3,FALSE)","v":200},"NA","NA","NA",{"$f":"IF(OR(L17=\"NA\",L17=\"E\"),\"NA\",IF(L17=\"Y\",COUNTIF($M$1:N16,N17)+1,COUNTIF($M$1:N16,N17)+1))","v":"NA"},"NA","NA","NA","Day0_Time_Slot1_Parallel 04"]
[17,"Day0_Time_Slot1_Parallel 05","Day0_Time_Slot1",0,1,"Parallel 05",{"$f":"VLOOKUP($D$1&D18,UNWDF_Hangzhou_2023!A:F,5,FALSE)","v":"2023-04-24"},{"$f":"MID(VLOOKUP($D$1&D18&$E$1&E18,UNWDF_Hangzhou_2023!A:F,5,FALSE),1,SEARCH(\"(\",VLOOKUP($D$1&D18&$E$1&E18,UNWDF_Hangzhou_2023!A:F,5,FALSE))-2)","v":"10:00 - 11:00"},"1:00",{"$f":"HLOOKUP($F18,UNWDF_Hangzhou_2023!$H$14:$S$16,2,FALSE)","v":"Room 05"},{"$f":"HLOOKUP($F18,UNWDF_Hangzhou_2023!$H$14:$S$16,3,FALSE)","v":200},"NA","NA","NA",{"$f":"IF(OR(L18=\"NA\",L18=\"E\"),\"NA\",IF(L18=\"Y\",COUNTIF($M$1:N17,N18)+1,COUNTIF($M$1:N17,N18)+1))","v":"NA"},"NA","NA","NA","Day0_Time_Slot1_Parallel 05"]
[18,"Day0_Time_Slot1_Parallel 06","Day0_Time_Slot1",0,1,"Parallel 06",{"$f":"VLOOKUP($D$1&D19,UNWDF_Hangzhou_2023!A:F,5,FALSE)","v":"2023-04-24"},{"$f":"MID(VLOOKUP($D$1&D19&$E$1&E19,UNWDF_Hangzhou_2023!A:F,5,FALSE),1,SEARCH(\"(\",VLOOKUP($D$1&D19&$E$1&E19,UNWDF_Hangzhou_2023!A:F,5,FALSE))-2)","v":"10:00 - 11:00"},"1:00",{"$f":"HLOOKUP($F19,UNWDF_Hangzhou_2023!$H$14:$S$16,2,FALSE)","v":"Room 06"},{"$f":"HLOOKUP($F19,UNWDF_Hangzhou_2023!$H$14:$S$16,3,FALSE)","v":200},"NA","NA","NA",{"$f":"IF(OR(L19=\"NA\",L19=\"E\"),\"NA\",IF(L19=\"Y\",COUNTIF($M$1:N18,N19)+1,COUNTIF($M$1:N18,N19)+1))","v":"NA"},"NA","NA","NA","Day0_Time_Slot1_Parallel 06"]
[19,"Day0_Time_Slot1_Parallel 07","Day0_Time_Slot1",0,1,"Parallel 07",{"$f":"VLOOKUP($D$1&D20,UNWDF_Hangzhou_2023!A:F,5,FALSE)","v":"2023-04-24"},{"$f":"MID(VLOOKUP($D$1&D20&$E$1&E20,UNWDF_Hangzhou_2023!A:F,5,FALSE),1,SEARCH(\"(\",VLOOKUP($D$1&D20&$E$1&E20,UNWDF_Hangzhou_2023!A:F,5,FALSE))-2)","v":"10:00 - 11:00"},"1:00",{"$f":"HLOOKUP($F20,UNWDF_Hangzhou_2023!$H$14:$S$16,2,FALSE)","v":"Room 07"},{"$f":"HLOOKUP($F20,UNWDF_Hangzhou_2023!$H$14:$S$16,3,FALSE)","v":100},"NA","NA","NA",{"$f":"IF(OR(L20=\"NA\",L20=\"E\"),\"NA\",IF(L20=\"Y\",COUNTIF($M$1:N19,N20)+1,COUNTIF($M$1:N19,N20)+1))","v":"NA"},"NA","NA","NA","Day0_Time_Slot1_Parallel 07"]
{"$rows_left_out":225}