{"text_format":"1","workbook":"xlsx","n_sheets":2,"sheets":["UNWDF_Medellín_2024_en","UNWDF2024_LookUp"],"not_rendered":{"charts":0,"images":1,"macros":1,"external_links":3,"defined_names":52,"comments":0,"pivot_tables":0},"unopened":[],"bounds":{"document_bytes":16777216,"sheet_cells":100000,"rows_first":2000,"rows_last":500,"rows_between":2000,"halvings":0,"cell_chars":16384,"cell_head_chars":4096},"cells_cut":0,"cells_raw":0,"read":"whole","date_system":"1900"}

{"sheet":"UNWDF_Medellín_2024_en","index":0,"n_rows":126,"n_cols":19,"rows_kept":126,"cut":false,"hidden":false,"merged":[[107,5,110,5],[102,5,105,5],[92,5,95,5],[97,5,100,5],[112,5,115,5],[116,6,116,15],[106,6,106,17],[123,9,123,11],[123,13,123,16],[125,9,125,11],[125,13,125,16],[111,6,111,17],[90,5,91,5],[117,5,118,5],[120,5,121,5],[45,6,45,15],[56,5,59,5],[119,6,119,15],[81,5,82,5],[71,5,74,5],[101,6,101,17],[84,9,84,11],[84,13,84,16],[86,9,86,11],[86,13,86,16],[80,6,80,15],[88,5,88,17],[70,6,70,17],[3,5,3,17],[49,9,49,11],[49,13,49,16],[51,9,51,11],[51,13,51,16],[14,5,15,5],[31,5,34,5],[21,5,24,5],[16,5,19,5],[26,5,29,5],[9,6,9,17],[20,6,20,17],[0,5,0,17],[1,5,1,17],[2,5,2,17],[96,6,96,17],[41,5,44,5],[46,5,47,5],[76,5,79,5],[54,5,55,5],[61,5,64,5],[66,5,69,5],[36,5,39,5],[5,5,6,5],[10,5,11,5],[7,5,8,5],[60,6,60,17],[65,6,65,17],[75,6,75,17],[12,5,12,17],[52,5,52,17],[25,6,25,17],[30,6,30,17],[35,6,35,17],[40,6,40,17]]}
[null,null,null,"Day",12,"UNITED NATIONS WORLD DATA FORUM 2024 (12 - 15 NOVEMBER)"]
[null,"NOW (Local time)",{"$f":"NOW()","v":"2024-11-13T11:21:05.890"},"Month",11,"Plaza Mayor Medellín Conventions and Exhibitions, Medellín, Colombia"]
[null,"GMT-5/UTC-5 (Medellín time)",{"$f":"Local2GMT(NOW())+(-5/24)","v":"2024-11-13T11:21:05.890"},"Year",2024,"Provisional programme, as of 13 November 2024"]
["Day0",null,null,null,{"$f":"DATE($E$3,$E$2,$E$1+MID(B8,4,1))","v":"2024-11-12"},{"$f":"IF(ISERROR(DATE($E$3,$E$2,$E$1+MID(B8,4,1))+TIME(MID(E8,1,2),MID(E8,4,2),0)+($C$2-$C$3)),DATE($E$3,$E$2,$E$1+MID(B8,4,1)),TEXT(DATE($E$3,$E$2,$E$1+MID(B8,4,1))+TIME(MID(E8,1,2),MID(E8,4,2),0)+($C$2-$C$3),\"DDDDDD, DD MMMM YYYY\")&\" [Date changes shown on row]\")","v":"Tuesday, 12 November 2024 [Date changes shown on row]"}]
[null,null,"LookUp",null,null,null,"LookUp","Parallel 01","Parallel 02","Parallel 03","Parallel 04","Parallel 05","Parallel 06","Parallel 07","Parallel 08","Parallel 09","Parallel 10","Parallel 11","Parallel 12"]
[null,null,null,null,null,"Time (Auto-adjusts to your local time, unless \"(Medellín time)\" shown)","Rm Name","Plenary Room","Room 1","Room 2","Room 3","Room 4","Room 5","Room 6","Room 7","Room 8","Room 9","Room 10","NA"]
["DayTime_LookUp","Day_LookUp","Time_LookUp","Col_LookUp","Time (GMT/UTC time-5)",null,"Capacity",3000,300,200,200,200,200,150,150,90,60,60,"NA"]
[{"$f":"B8&C8","v":"Day0Time_Slot1"},"Day0","Time_Slot1",16,"11:00 - 12:00 (Medellín Time)",{"$f":"IF(ISERROR(TEXT((DATE($E$3,$E$2,$E$1+MID(B8,4,1))+TIME(MID(E8,1,2),MID(E8,4,2),0))+($C$2-$C$3),\"H:MM AM/PM\")&\" - \"&TEXT(DATE($E$3,$E$2,$E$1+MID(B8,4,1))+TIME(MID(E8,9,2),MID(E8,12,2),0)+($C$2-$C$3),\"H:MM AM/PM\")),E8,TEXT(DATE($E$3,$E$2,$E$1+MID(B8,4,1))+TIME(MID(E8,1,2),MID(E8,4,2),0)+($C$2-$C$3),\"DDDD DD MMM\")&\" : \"&TEXT((DATE($E$3,$E$2,$E$1+MID(B8,4,1))+TIME(MID(E8,1,2),MID(E8,4,2),0))+($C$2-$C$3),\"H:MM AM/PM\")&\" - \"&TEXT(DATE($E$3,$E$2,$E$1+MID(B8,4,1))+TIME(MID(E8,9,2),MID(E8,12,2),0)+($C$2-$C$3),\"H:MM AM/PM\"))","v":"Tuesday 12 Nov : 11:00 AM - 12:00 PM"},"Event Title",{"$f":"IF(VLOOKUP($B8&\"_\"&$C8&\"_\"&H$14,UNWDF2024_LookUp!$B:$T,$D8,FALSE)=0,\"\",VLOOKUP($B8&\"_\"&$C8&\"_\"&H$14,UNWDF2024_LookUp!$B:$T,$D8,FALSE))","v":"Opening press conference (LOCATION: Media Corner)"}]
["Day0Time_Slot1","Day0","Time_Slot1",17,"",null,"Organiser",{"$f":"IF(VLOOKUP($B9&\"_\"&$C9&\"_\"&H$14,UNWDF2024_LookUp!$B:$T,$D9,FALSE)=0,\"\",VLOOKUP($B9&\"_\"&$C9&\"_\"&H$14,UNWDF2024_LookUp!$B:$T,$D9,FALSE))","v":"Departamento Administrativo Nacional de Estadística (DANE-Colombia); United Nations Statistics Division (UNSD-DESA)"}]
[null,"Day0",null,null,"12:00 - 15:30 (Medellín time)",{"$f":"IF(ISERROR(TEXT((DATE($E$3,$E$2,$E$1+MID(B10,4,1))+TIME(MID(E10,1,2),MID(E10,4,2),0))+($C$2-$C$3),\"H:MM AM/PM\")&\" - \"&TEXT(DATE($E$3,$E$2,$E$1+MID(B10,4,1))+TIME(MID(E10,9,2),MID(E10,12,2),0)+($C$2-$C$3),\"H:MM AM/PM\")),E10,TEXT((DATE($E$3,$E$2,$E$1+MID(B10,4,1))+TIME(MID(E10,1,2),MID(E10,4,2),0))+($C$2-$C$3),\"H:MM AM/PM\")&\" - \"&TEXT(DATE($E$3,$E$2,$E$1+MID(B10,4,1))+TIME(MID(E10,9,2),MID(E10,12,2),0)+($C$2-$C$3),\"H:MM AM/PM\"))","v":"12:00 PM - 3:30 PM"},"BREAK"]
[{"$f":"B11&C11","v":"Day0Time_Slot2"},"Day0","Time_Slot2",16,"15:30 - 17:00 (Medellín Time)",{"$f":"IF(ISERROR(TEXT((DATE($E$3,$E$2,$E$1+MID(B11,4,1))+TIME(MID(E11,1,2),MID(E11,4,2),0))+($C$2-$C$3),\"H:MM AM/PM\")&\" - \"&TEXT(DATE($E$3,$E$2,$E$1+MID(B11,4,1))+TIME(MID(E11,9,2),MID(E11,12,2),0)+($C$2-$C$3),\"H:MM AM/PM\")),E11,TEXT(DATE($E$3,$E$2,$E$1+MID(B11,4,1))+TIME(MID(E11,1,2),MID(E11,4,2),0)+($C$2-$C$3),\"DDDD DD MMM\")&\" : \"&TEXT((DATE($E$3,$E$2,$E$1+MID(B11,4,1))+TIME(MID(E11,1,2),MID(E11,4,2),0))+($C$2-$C$3),\"H:MM AM/PM\")&\" - \"&TEXT(DATE($E$3,$E$2,$E$1+MID(B11,4,1))+TIME(MID(E11,9,2),MID(E11,12,2),0)+($C$2-$C$3),\"H:MM AM/PM\"))","v":"Tuesday 12 Nov : 3:30 PM - 5:00 PM"},"Event Title",{"$f":"IF(VLOOKUP($B11&\"_\"&$C11&\"_\"&H$14,UNWDF2024_LookUp!$B:$T,$D11,FALSE)=0,\"\",VLOOKUP($B11&\"_\"&$C11&\"_\"&H$14,UNWDF2024_LookUp!$B:$T,$D11,FALSE))","v":"Opening ceremony"}]
["Day0Time_Slot2","Day0","Time_Slot2",17,"",null,"Organiser",{"$f":"IF(VLOOKUP($B12&\"_\"&$C12&\"_\"&H$14,UNWDF2024_LookUp!$B:$T,$D12,FALSE)=0,\"\",VLOOKUP($B12&\"_\"&$C12&\"_\"&H$14,UNWDF2024_LookUp!$B:$T,$D12,FALSE))","v":"Departamento Administrativo Nacional de Estadística (DANE-Colombia)"}]
["Day1",null,null,null,{"$f":"DATE($E$3,$E$2,$E$1+MID(B17,4,1))","v":"2024-11-13"},{"$f":"IF(ISERROR(DATE($E$3,$E$2,$E$1+MID(B17,4,1))+TIME(MID(E17,1,2),MID(E17,4,2),0)+($C$2-$C$3)),DATE($E$3,$E$2,$E$1+MID(B17,4,1)),TEXT(DATE($E$3,$E$2,$E$1+MID(B17,4,1))+TIME(MID(E17,1,2),MID(E17,4,2),0)+($C$2-$C$3),\"DDDDDD, DD MMMM YYYY\")&\" [Date changes shown on row]\")","v":"Wednesday, 13 November 2024 [Date changes shown on row]"}]
[null,null,"LookUp",null,null,null,"LookUp","Parallel 01","Parallel 02","Parallel 03","Parallel 04","Parallel 05","Parallel 06","Parallel 07","Parallel 08","Parallel 09","Parallel 10","Parallel 11","Parallel 12"]
[null,null,null,null,null,"Time (Auto-adjusts to your local time, unless \"(Medellín time)\" shown)","Rm Name","Plenary Room","Room 1","Room 2","Room 3","Room 4","Room 5","Room 6","Room 7","Room 8","Room 9","Room 10","NA"]
["DayTime_LookUp","Day_LookUp","Time_LookUp","Col_LookUp","Time (GMT/UTC time+8)",null,"Capacity",3000,300,200,200,200,200,150,150,90,60,60,"NA"]
[{"$f":"B17&C17","v":"Day1Time_Slot1"},"Day1","Time_Slot1",15,"09:00 - 10:30 (Medellín time)",{"$f":"IF(ISERROR(TEXT((DATE($E$3,$E$2,$E$1+MID(B17,4,1))+TIME(MID(E17,1,2),MID(E17,4,2),0))+($C$2-$C$3),\"H:MM AM/PM\")&\" - \"&TEXT(DATE($E$3,$E$2,$E$1+MID(B17,4,1))+TIME(MID(E17,9,2),MID(E17,12,2),0)+($C$2-$C$3),\"H:MM AM/PM\")),E17,TEXT(DATE($E$3,$E$2,$E$1+MID(B17,4,1))+TIME(MID(E17,1,2),MID(E17,4,2),0)+($C$2-$C$3),\"DDDD DD MMM\")&\" : \"&TEXT((DATE($E$3,$E$2,$E$1+MID(B17,4,1))+TIME(MID(E17,1,2),MID(E17,4,2),0))+($C$2-$C$3),\"H:MM AM/PM\")&\" - \"&TEXT(DATE($E$3,$E$2,$E$1+MID(B17,4,1))+TIME(MID(E17,9,2),MID(E17,12,2),0)+($C$2-$C$3),\"H:MM AM/PM\"))","v":"Wednesday 13 Nov : 9:00 AM - 10:30 AM"},"Event_ID",{"$f":"IF(VLOOKUP($B17&\"_\"&$C17&\"_\"&H$14,UNWDF2024_LookUp!$B:$T,$D17,FALSE)=0,\"\",VLOOKUP($B17&\"_\"&$C17&\"_\"&H$14,UNWDF2024_LookUp!$B:$T,$D17,FALSE))","v":"TA_O.03"}]
["Day1Time_Slot1","Day1","Time_Slot1",13,"",null,"Thematic Area",{"$f":"IF(VLOOKUP($B18&\"_\"&$C18&\"_\"&H$14,UNWDF2024_LookUp!$B:$T,$D18,FALSE)=0,\"\",VLOOKUP($B18&\"_\"&$C18&\"_\"&H$14,UNWDF2024_LookUp!$B:$T,$D18,FALSE))","v":"_O"}]
[{"$f":"B19&C19","v":"Day1Time_Slot1"},"Day1","Time_Slot1",16,"",null,"Event Title",{"$f":"IF(VLOOKUP($B19&\"_\"&$C19&\"_\"&H$14,UNWDF2024_LookUp!$B:$T,$D19,FALSE)=0,\"\",VLOOKUP($B19&\"_\"&$C19&\"_\"&H$14,UNWDF2024_LookUp!$B:$T,$D19,FALSE))","v":"Welcome and introduction"}]
["Day1Time_Slot1","Day1","Time_Slot1",17,"",null,"Organiser",{"$f":"IF(VLOOKUP($B20&\"_\"&$C20&\"_\"&H$14,UNWDF2024_LookUp!$B:$T,$D20,FALSE)=0,\"\",VLOOKUP($B20&\"_\"&$C20&\"_\"&H$14,UNWDF2024_LookUp!$B:$T,$D20,FALSE))","v":"Departamento Administrativo Nacional de Estadística (DANE-Colombia) / United Nations Statistics Division (UNSD-DESA)"}]
{"$rows_left_out":107}
{"sheet":"UNWDF2024_LookUp","index":1,"n_rows":258,"n_cols":39,"rows_kept":258,"cut":false,"hidden":true,"merged":[]}
["ID","LookUp","Day/Time","Day","Time_Slot","Location","Date","Time","Duration","Room_Name","Room_Capacity","UNWDF2024_Plenary","UNWDF2024_ProposalID","UNWDF2024_TA","UNWDF2024_Session","UNWDF2024_ProgrammeID","UNWDF2024_SessionTitle_en","UNWDF2024_SessionOrg_en","UNWDF2024_SessionTitle_es","UNWDF2024_SessionOrg_es","LookUp","Comment"]
[1,{"$f":"C2&\"_\"&F2","v":"Day0_Time_Slot1_Parallel 01"},{"$f":"$D$1&D2&\"_\"&$E$1&E2","v":"Day0_Time_Slot1"},0,1,"Parallel 01",{"$f":"VLOOKUP($D$1&D2,UNWDF_Medellín_2024_en!A:F,5,FALSE)","v":"2024-11-12"},{"$f":"MID(VLOOKUP($D$1&D2&$E$1&E2,UNWDF_Medellín_2024_en!A:F,5,FALSE),1,SEARCH(\"(\",VLOOKUP($D$1&D2&$E$1&E2,UNWDF_Medellín_2024_en!A:F,5,FALSE))-2)","v":"11:00 - 12:00"},{"$f":"TEXT(MID(H2,SEARCH(\"-\",H2)+2,LEN(H2)-SEARCH(\"-\",H2)-1)-MID(H2,1,SEARCH(\"-\",H2)-1),\"h:mm\")","v":"1:00"},{"$f":"HLOOKUP($F2,UNWDF_Medellín_2024_en!$H$14:$S$16,2,FALSE)","v":"Plenary Room"},{"$f":"HLOOKUP($F2,UNWDF_Medellín_2024_en!$H$14:$S$16,3,FALSE)","v":3000},"Y","NA","_P",{"$f":"IF(OR(L2=\"NA\",L2=\"E\"),\"NA\",IF(L2=\"Y\",COUNTIF($M$1:N1,N2)+1,COUNTIF($M$1:N1,N2)+1))","v":1},"TA_P.01","Opening press conference (LOCATION: Media Corner)","Departamento Administrativo Nacional de Estadística (DANE-Colombia); United Nations Statistics Division (UNSD-DESA)","Conferencia de prensa de apertura (UBICACIÓN: ÁREA DE MEDIOS)","Departamento Administrativo Nacional de Estadística (DANE-Colombia); División de Estadísticas de las Naciones Unidas (UNSD-DESA)",{"$f":"B2","v":"Day0_Time_Slot1_Parallel 01"},"NEW TIME",{"$f":"I2","v":"1:00"}]
[14,"Day0_Time_Slot1_Parallel 02","Day0_Time_Slot1",0,1,"Parallel 02",{"$f":"VLOOKUP($D$1&D3,UNWDF_Medellín_2024_en!A:F,5,FALSE)","v":"2024-11-12"},{"$f":"MID(VLOOKUP($D$1&D3&$E$1&E3,UNWDF_Medellín_2024_en!A:F,5,FALSE),1,SEARCH(\"(\",VLOOKUP($D$1&D3&$E$1&E3,UNWDF_Medellín_2024_en!A:F,5,FALSE))-2)","v":"11:00 - 12:00"},"1:00",{"$f":"HLOOKUP($F3,UNWDF_Medellín_2024_en!$H$14:$S$16,2,FALSE)","v":"Room 1"},{"$f":"HLOOKUP($F3,UNWDF_Medellín_2024_en!$H$14:$S$16,3,FALSE)","v":300},"NA","NA","NA",{"$f":"IF(OR(L3=\"NA\",L3=\"E\"),\"NA\",IF(L3=\"Y\",COUNTIF($M$1:N2,N3)+1,COUNTIF($M$1:N2,N3)+1))","v":"NA"},{"$f":"IF(N3=\"NA\",\"NA\",\"TA\"&N3&\".\"&TEXT(O3,\"0#\"))","v":"NA"},"NA","NA","NA","NA","Day0_Time_Slot1_Parallel 02",null,{"$f":"I3","v":"1:00"}]
[15,"Day0_Time_Slot1_Parallel 03","Day0_Time_Slot1",0,1,"Parallel 03",{"$f":"VLOOKUP($D$1&D4,UNWDF_Medellín_2024_en!A:F,5,FALSE)","v":"2024-11-12"},{"$f":"MID(VLOOKUP($D$1&D4&$E$1&E4,UNWDF_Medellín_2024_en!A:F,5,FALSE),1,SEARCH(\"(\",VLOOKUP($D$1&D4&$E$1&E4,UNWDF_Medellín_2024_en!A:F,5,FALSE))-2)","v":"11:00 - 12:00"},"1:00",{"$f":"HLOOKUP($F4,UNWDF_Medellín_2024_en!$H$14:$S$16,2,FALSE)","v":"Room 2"},{"$f":"HLOOKUP($F4,UNWDF_Medellín_2024_en!$H$14:$S$16,3,FALSE)","v":200},"NA","NA","NA",{"$f":"IF(OR(L4=\"NA\",L4=\"E\"),\"NA\",IF(L4=\"Y\",COUNTIF($M$1:N3,N4)+1,COUNTIF($M$1:N3,N4)+1))","v":"NA"},"NA","NA","NA","NA","NA","Day0_Time_Slot1_Parallel 03",null,"1:00"]
[16,"Day0_Time_Slot1_Parallel 04","Day0_Time_Slot1",0,1,"Parallel 04",{"$f":"VLOOKUP($D$1&D5,UNWDF_Medellín_2024_en!A:F,5,FALSE)","v":"2024-11-12"},{"$f":"MID(VLOOKUP($D$1&D5&$E$1&E5,UNWDF_Medellín_2024_en!A:F,5,FALSE),1,SEARCH(\"(\",VLOOKUP($D$1&D5&$E$1&E5,UNWDF_Medellín_2024_en!A:F,5,FALSE))-2)","v":"11:00 - 12:00"},"1:00",{"$f":"HLOOKUP($F5,UNWDF_Medellín_2024_en!$H$14:$S$16,2,FALSE)","v":"Room 3"},{"$f":"HLOOKUP($F5,UNWDF_Medellín_2024_en!$H$14:$S$16,3,FALSE)","v":200},"NA","NA","NA",{"$f":"IF(OR(L5=\"NA\",L5=\"E\"),\"NA\",IF(L5=\"Y\",COUNTIF($M$1:N4,N5)+1,COUNTIF($M$1:N4,N5)+1))","v":"NA"},"NA","NA","NA","NA","NA","Day0_Time_Slot1_Parallel 04",null,"1:00"]
[17,"Day0_Time_Slot1_Parallel 05","Day0_Time_Slot1",0,1,"Parallel 05",{"$f":"VLOOKUP($D$1&D6,UNWDF_Medellín_2024_en!A:F,5,FALSE)","v":"2024-11-12"},{"$f":"MID(VLOOKUP($D$1&D6&$E$1&E6,UNWDF_Medellín_2024_en!A:F,5,FALSE),1,SEARCH(\"(\",VLOOKUP($D$1&D6&$E$1&E6,UNWDF_Medellín_2024_en!A:F,5,FALSE))-2)","v":"11:00 - 12:00"},"1:00",{"$f":"HLOOKUP($F6,UNWDF_Medellín_2024_en!$H$14:$S$16,2,FALSE)","v":"Room 4"},{"$f":"HLOOKUP($F6,UNWDF_Medellín_2024_en!$H$14:$S$16,3,FALSE)","v":200},"NA","NA","NA",{"$f":"IF(OR(L6=\"NA\",L6=\"E\"),\"NA\",IF(L6=\"Y\",COUNTIF($M$1:N5,N6)+1,COUNTIF($M$1:N5,N6)+1))","v":"NA"},"NA","NA","NA","NA","NA","Day0_Time_Slot1_Parallel 05",null,"1:00"]
[18,"Day0_Time_Slot1_Parallel 06","Day0_Time_Slot1",0,1,"Parallel 06",{"$f":"VLOOKUP($D$1&D7,UNWDF_Medellín_2024_en!A:F,5,FALSE)","v":"2024-11-12"},{"$f":"MID(VLOOKUP($D$1&D7&$E$1&E7,UNWDF_Medellín_2024_en!A:F,5,FALSE),1,SEARCH(\"(\",VLOOKUP($D$1&D7&$E$1&E7,UNWDF_Medellín_2024_en!A:F,5,FALSE))-2)","v":"11:00 - 12:00"},"1:00",{"$f":"HLOOKUP($F7,UNWDF_Medellín_2024_en!$H$14:$S$16,2,FALSE)","v":"Room 5"},{"$f":"HLOOKUP($F7,UNWDF_Medellín_2024_en!$H$14:$S$16,3,FALSE)","v":200},"NA","NA","NA",{"$f":"IF(OR(L7=\"NA\",L7=\"E\"),\"NA\",IF(L7=\"Y\",COUNTIF($M$1:N6,N7)+1,COUNTIF($M$1:N6,N7)+1))","v":"NA"},"NA","NA","NA","NA","NA","Day0_Time_Slot1_Parallel 06",null,"1:00"]
[19,"Day0_Time_Slot1_Parallel 07","Day0_Time_Slot1",0,1,"Parallel 07",{"$f":"VLOOKUP($D$1&D8,UNWDF_Medellín_2024_en!A:F,5,FALSE)","v":"2024-11-12"},{"$f":"MID(VLOOKUP($D$1&D8&$E$1&E8,UNWDF_Medellín_2024_en!A:F,5,FALSE),1,SEARCH(\"(\",VLOOKUP($D$1&D8&$E$1&E8,UNWDF_Medellín_2024_en!A:F,5,FALSE))-2)","v":"11:00 - 12:00"},"1:00",{"$f":"HLOOKUP($F8,UNWDF_Medellín_2024_en!$H$14:$S$16,2,FALSE)","v":"Room 6"},{"$f":"HLOOKUP($F8,UNWDF_Medellín_2024_en!$H$14:$S$16,3,FALSE)","v":150},"NA","NA","NA",{"$f":"IF(OR(L8=\"NA\",L8=\"E\"),\"NA\",IF(L8=\"Y\",COUNTIF($M$1:N7,N8)+1,COUNTIF($M$1:N7,N8)+1))","v":"NA"},"NA","NA","NA","NA","NA","Day0_Time_Slot1_Parallel 07",null,"1:00"]
[20,"Day0_Time_Slot1_Parallel 08","Day0_Time_Slot1",0,1,"Parallel 08",{"$f":"VLOOKUP($D$1&D9,UNWDF_Medellín_2024_en!A:F,5,FALSE)","v":"2024-11-12"},{"$f":"MID(VLOOKUP($D$1&D9&$E$1&E9,UNWDF_Medellín_2024_en!A:F,5,FALSE),1,SEARCH(\"(\",VLOOKUP($D$1&D9&$E$1&E9,UNWDF_Medellín_2024_en!A:F,5,FALSE))-2)","v":"11:00 - 12:00"},"1:00",{"$f":"HLOOKUP($F9,UNWDF_Medellín_2024_en!$H$14:$S$16,2,FALSE)","v":"Room 7"},{"$f":"HLOOKUP($F9,UNWDF_Medellín_2024_en!$H$14:$S$16,3,FALSE)","v":150},"NA","NA","NA",{"$f":"IF(OR(L9=\"NA\",L9=\"E\"),\"NA\",IF(L9=\"Y\",COUNTIF($M$1:N8,N9)+1,COUNTIF($M$1:N8,N9)+1))","v":"NA"},"NA","NA","NA","NA","NA","Day0_Time_Slot1_Parallel 08",null,"1:00"]
[21,"Day0_Time_Slot1_Parallel 09","Day0_Time_Slot1",0,1,"Parallel 09",{"$f":"VLOOKUP($D$1&D10,UNWDF_Medellín_2024_en!A:F,5,FALSE)","v":"2024-11-12"},{"$f":"MID(VLOOKUP($D$1&D10&$E$1&E10,UNWDF_Medellín_2024_en!A:F,5,FALSE),1,SEARCH(\"(\",VLOOKUP($D$1&D10&$E$1&E10,UNWDF_Medellín_2024_en!A:F,5,FALSE))-2)","v":"11:00 - 12:00"},"1:00",{"$f":"HLOOKUP($F10,UNWDF_Medellín_2024_en!$H$14:$S$16,2,FALSE)","v":"Room 8"},{"$f":"HLOOKUP($F10,UNWDF_Medellín_2024_en!$H$14:$S$16,3,FALSE)","v":90},"NA","NA","NA",{"$f":"IF(OR(L10=\"NA\",L10=\"E\"),\"NA\",IF(L10=\"Y\",COUNTIF($M$1:N9,N10)+1,COUNTIF($M$1:N9,N10)+1))","v":"NA"},"NA","NA","NA","NA","NA","Day0_Time_Slot1_Parallel 09",null,"1:00"]
[22,"Day0_Time_Slot1_Parallel 10","Day0_Time_Slot1",0,1,"Parallel 10",{"$f":"VLOOKUP($D$1&D11,UNWDF_Medellín_2024_en!A:F,5,FALSE)","v":"2024-11-12"},{"$f":"MID(VLOOKUP($D$1&D11&$E$1&E11,UNWDF_Medellín_2024_en!A:F,5,FALSE),1,SEARCH(\"(\",VLOOKUP($D$1&D11&$E$1&E11,UNWDF_Medellín_2024_en!A:F,5,FALSE))-2)","v":"11:00 - 12:00"},"1:00",{"$f":"HLOOKUP($F11,UNWDF_Medellín_2024_en!$H$14:$S$16,2,FALSE)","v":"Room 9"},{"$f":"HLOOKUP($F11,UNWDF_Medellín_2024_en!$H$14:$S$16,3,FALSE)","v":60},"NA","NA","NA",{"$f":"IF(OR(L11=\"NA\",L11=\"E\"),\"NA\",IF(L11=\"Y\",COUNTIF($M$1:N10,N11)+1,COUNTIF($M$1:N10,N11)+1))","v":"NA"},"NA","NA","NA","NA","NA","Day0_Time_Slot1_Parallel 10",null,"1:00"]
[23,"Day0_Time_Slot1_Parallel 11","Day0_Time_Slot1",0,1,"Parallel 11",{"$f":"VLOOKUP($D$1&D12,UNWDF_Medellín_2024_en!A:F,5,FALSE)","v":"2024-11-12"},{"$f":"MID(VLOOKUP($D$1&D12&$E$1&E12,UNWDF_Medellín_2024_en!A:F,5,FALSE),1,SEARCH(\"(\",VLOOKUP($D$1&D12&$E$1&E12,UNWDF_Medellín_2024_en!A:F,5,FALSE))-2)","v":"11:00 - 12:00"},"1:00",{"$f":"HLOOKUP($F12,UNWDF_Medellín_2024_en!$H$14:$S$16,2,FALSE)","v":"Room 10"},{"$f":"HLOOKUP($F12,UNWDF_Medellín_2024_en!$H$14:$S$16,3,FALSE)","v":60},"NA","NA","NA",{"$f":"IF(OR(L12=\"NA\",L12=\"E\"),\"NA\",IF(L12=\"Y\",COUNTIF($M$1:N11,N12)+1,COUNTIF($M$1:N11,N12)+1))","v":"NA"},"NA","NA","NA","NA","NA","Day0_Time_Slot1_Parallel 11",null,"1:00"]
[24,"Day0_Time_Slot1_Parallel 12","Day0_Time_Slot1",0,1,"Parallel 12",{"$f":"VLOOKUP($D$1&D13,UNWDF_Medellín_2024_en!A:F,5,FALSE)","v":"2024-11-12"},{"$f":"MID(VLOOKUP($D$1&D13&$E$1&E13,UNWDF_Medellín_2024_en!A:F,5,FALSE),1,SEARCH(\"(\",VLOOKUP($D$1&D13&$E$1&E13,UNWDF_Medellín_2024_en!A:F,5,FALSE))-2)","v":"11:00 - 12:00"},"1:00",{"$f":"HLOOKUP($F13,UNWDF_Medellín_2024_en!$H$14:$S$16,2,FALSE)","v":"NA"},{"$f":"HLOOKUP($F13,UNWDF_Medellín_2024_en!$H$14:$S$16,3,FALSE)","v":"NA"},"NA","NA","NA",{"$f":"IF(OR(L13=\"NA\",L13=\"E\"),\"NA\",IF(L13=\"Y\",COUNTIF($M$1:N12,N13)+1,COUNTIF($M$1:N12,N13)+1))","v":"NA"},"NA","NA","NA","NA","NA","Day0_Time_Slot1_Parallel 12",null,"1:00"]
[2,"Day0_Time_Slot2_Parallel 01","Day0_Time_Slot2",0,2,"Parallel 01",{"$f":"VLOOKUP($D$1&D14,UNWDF_Medellín_2024_en!A:F,5,FALSE)","v":"2024-11-12"},{"$f":"MID(VLOOKUP($D$1&D14&$E$1&E14,UNWDF_Medellín_2024_en!A:F,5,FALSE),1,SEARCH(\"(\",VLOOKUP($D$1&D14&$E$1&E14,UNWDF_Medellín_2024_en!A:F,5,FALSE))-2)","v":"15:30 - 17:00"},"1:30",{"$f":"HLOOKUP($F14,UNWDF_Medellín_2024_en!$H$14:$S$16,2,FALSE)","v":"Plenary Room"},{"$f":"HLOOKUP($F14,UNWDF_Medellín_2024_en!$H$14:$S$16,3,FALSE)","v":3000},"Y","NA","_O",{"$f":"IF(OR(L14=\"NA\",L14=\"E\"),\"NA\",IF(L14=\"Y\",COUNTIF($M$1:N13,N14)+1,COUNTIF($M$1:N13,N14)+1))","v":1},"TA_O.01","Opening ceremony","Departamento Administrativo Nacional de Estadística (DANE-Colombia)","Ceremonia de apertura","Departamento Administrativo Nacional de Estadística (DANE-Colombia)","Day0_Time_Slot2_Parallel 01",null,"1:30"]
[3,"Day1_Time_Slot1_Parallel 01","Day1_Time_Slot1",1,1,"Parallel 01",{"$f":"VLOOKUP($D$1&D15,UNWDF_Medellín_2024_en!A:F,5,FALSE)","v":"2024-11-13"},{"$f":"MID(VLOOKUP($D$1&D15&$E$1&E15,UNWDF_Medellín_2024_en!A:F,5,FALSE),1,SEARCH(\"(\",VLOOKUP($D$1&D15&$E$1&E15,UNWDF_Medellín_2024_en!A:F,5,FALSE))-2)","v":"09:00 - 10:30"},"1:30",{"$f":"HLOOKUP($F15,UNWDF_Medellín_2024_en!$H$14:$S$16,2,FALSE)","v":"Plenary Room"},{"$f":"HLOOKUP($F15,UNWDF_Medellín_2024_en!$H$14:$S$16,3,FALSE)","v":3000},"Y","NA","_O",3,"TA_O.03","Welcome and introduction","Departamento Administrativo Nacional de Estadística (DANE-Colombia) / United Nations Statistics Division (UNSD-DESA)","Bienvenida e introducción","Departamento Administrativo Nacional de Estadística (DANE-Colombia) / División de Estadísticas de las Naciones Unidas (UNSD-DESA)","Day1_Time_Slot1_Parallel 01",null,"1:30"]
[25,"Day1_Time_Slot1_Parallel 02","Day1_Time_Slot1",1,1,"Parallel 02",{"$f":"VLOOKUP($D$1&D16,UNWDF_Medellín_2024_en!A:F,5,FALSE)","v":"2024-11-13"},{"$f":"MID(VLOOKUP($D$1&D16&$E$1&E16,UNWDF_Medellín_2024_en!A:F,5,FALSE),1,SEARCH(\"(\",VLOOKUP($D$1&D16&$E$1&E16,UNWDF_Medellín_2024_en!A:F,5,FALSE))-2)","v":"09:00 - 10:30"},"1:30",{"$f":"HLOOKUP($F16,UNWDF_Medellín_2024_en!$H$14:$S$16,2,FALSE)","v":"Room 1"},{"$f":"HLOOKUP($F16,UNWDF_Medellín_2024_en!$H$14:$S$16,3,FALSE)","v":300},"NA","NA","NA",{"$f":"IF(OR(L16=\"NA\",L16=\"E\"),\"NA\",IF(L16=\"Y\",COUNTIF($M$1:N15,N16)+1,COUNTIF($M$1:N15,N16)+1))","v":"NA"},{"$f":"IF(N16=\"NA\",\"NA\",\"TA\"&N16&\".\"&TEXT(O16,\"0#\"))","v":"NA"},"NA","NA","NA","NA","Day1_Time_Slot1_Parallel 02",null,"1:30"]
[26,"Day1_Time_Slot1_Parallel 03","Day1_Time_Slot1",1,1,"Parallel 03",{"$f":"VLOOKUP($D$1&D17,UNWDF_Medellín_2024_en!A:F,5,FALSE)","v":"2024-11-13"},{"$f":"MID(VLOOKUP($D$1&D17&$E$1&E17,UNWDF_Medellín_2024_en!A:F,5,FALSE),1,SEARCH(\"(\",VLOOKUP($D$1&D17&$E$1&E17,UNWDF_Medellín_2024_en!A:F,5,FALSE))-2)","v":"09:00 - 10:30"},"1:30",{"$f":"HLOOKUP($F17,UNWDF_Medellín_2024_en!$H$14:$S$16,2,FALSE)","v":"Room 2"},{"$f":"HLOOKUP($F17,UNWDF_Medellín_2024_en!$H$14:$S$16,3,FALSE)","v":200},"NA","NA","NA",{"$f":"IF(OR(L17=\"NA\",L17=\"E\"),\"NA\",IF(L17=\"Y\",COUNTIF($M$1:N16,N17)+1,COUNTIF($M$1:N16,N17)+1))","v":"NA"},"NA","NA","NA","NA","NA","Day1_Time_Slot1_Parallel 03",null,"1:30"]
[27,"Day1_Time_Slot1_Parallel 04","Day1_Time_Slot1",1,1,"Parallel 04",{"$f":"VLOOKUP($D$1&D18,UNWDF_Medellín_2024_en!A:F,5,FALSE)","v":"2024-11-13"},{"$f":"MID(VLOOKUP($D$1&D18&$E$1&E18,UNWDF_Medellín_2024_en!A:F,5,FALSE),1,SEARCH(\"(\",VLOOKUP($D$1&D18&$E$1&E18,UNWDF_Medellín_2024_en!A:F,5,FALSE))-2)","v":"09:00 - 10:30"},"1:30",{"$f":"HLOOKUP($F18,UNWDF_Medellín_2024_en!$H$14:$S$16,2,FALSE)","v":"Room 3"},{"$f":"HLOOKUP($F18,UNWDF_Medellín_2024_en!$H$14:$S$16,3,FALSE)","v":200},"NA","NA","NA",{"$f":"IF(OR(L18=\"NA\",L18=\"E\"),\"NA\",IF(L18=\"Y\",COUNTIF($M$1:N17,N18)+1,COUNTIF($M$1:N17,N18)+1))","v":"NA"},"NA","NA","NA","NA","NA","Day1_Time_Slot1_Parallel 04",null,"1:30"]
[28,"Day1_Time_Slot1_Parallel 05","Day1_Time_Slot1",1,1,"Parallel 05",{"$f":"VLOOKUP($D$1&D19,UNWDF_Medellín_2024_en!A:F,5,FALSE)","v":"2024-11-13"},{"$f":"MID(VLOOKUP($D$1&D19&$E$1&E19,UNWDF_Medellín_2024_en!A:F,5,FALSE),1,SEARCH(\"(\",VLOOKUP($D$1&D19&$E$1&E19,UNWDF_Medellín_2024_en!A:F,5,FALSE))-2)","v":"09:00 - 10:30"},"1:30",{"$f":"HLOOKUP($F19,UNWDF_Medellín_2024_en!$H$14:$S$16,2,FALSE)","v":"Room 4"},{"$f":"HLOOKUP($F19,UNWDF_Medellín_2024_en!$H$14:$S$16,3,FALSE)","v":200},"NA","NA","NA",{"$f":"IF(OR(L19=\"NA\",L19=\"E\"),\"NA\",IF(L19=\"Y\",COUNTIF($M$1:N18,N19)+1,COUNTIF($M$1:N18,N19)+1))","v":"NA"},"NA","NA","NA","NA","NA","Day1_Time_Slot1_Parallel 05","","1:30"]
[29,"Day1_Time_Slot1_Parallel 06","Day1_Time_Slot1",1,1,"Parallel 06",{"$f":"VLOOKUP($D$1&D20,UNWDF_Medellín_2024_en!A:F,5,FALSE)","v":"2024-11-13"},{"$f":"MID(VLOOKUP($D$1&D20&$E$1&E20,UNWDF_Medellín_2024_en!A:F,5,FALSE),1,SEARCH(\"(\",VLOOKUP($D$1&D20&$E$1&E20,UNWDF_Medellín_2024_en!A:F,5,FALSE))-2)","v":"09:00 - 10:30"},"1:30",{"$f":"HLOOKUP($F20,UNWDF_Medellín_2024_en!$H$14:$S$16,2,FALSE)","v":"Room 5"},{"$f":"HLOOKUP($F20,UNWDF_Medellín_2024_en!$H$14:$S$16,3,FALSE)","v":200},"NA","NA","NA",{"$f":"IF(OR(L20=\"NA\",L20=\"E\"),\"NA\",IF(L20=\"Y\",COUNTIF($M$1:N19,N20)+1,COUNTIF($M$1:N19,N20)+1))","v":"NA"},"NA","NA","NA","NA","NA","Day1_Time_Slot1_Parallel 06","","1:30"]
{"$rows_left_out":238}