{"text_format":"1","workbook":"xlsx","n_sheets":2,"sheets":["Bern2021","UNWDF2021_LookUp"],"not_rendered":{"charts":0,"images":2,"macros":1,"external_links":3,"defined_names":52,"comments":0,"pivot_tables":0},"unopened":[],"bounds":{"document_bytes":16777216,"sheet_cells":100000,"rows_first":2000,"rows_last":500,"rows_between":2000,"halvings":0,"cell_chars":16384,"cell_head_chars":4096},"cells_cut":0,"cells_raw":0,"read":"whole","date_system":"1900"}

{"sheet":"Bern2021","index":0,"n_rows":125,"n_cols":16,"rows_kept":125,"cut":false,"hidden":false,"merged":[[124,5,124,15],[62,6,62,15],[67,6,67,15],[72,6,72,15],[63,5,66,5],[120,8,120,9],[122,8,122,9],[68,5,71,5],[85,5,86,15],[91,5,94,5],[96,5,99,5],[109,5,112,5],[89,5,90,5],[83,8,83,9],[81,8,81,9],[73,5,76,5],[51,5,52,5],[53,5,56,5],[58,5,61,5],[26,5,29,5],[46,8,46,9],[35,6,35,15],[36,5,39,5],[41,5,42,5],[49,5,49,15],[57,6,57,15],[46,11,46,12],[44,14,44,15],[44,11,44,12],[46,14,46,15],[44,8,44,9],[30,6,30,15],[0,5,0,15],[1,5,1,15],[2,5,2,15],[3,5,3,15],[10,5,10,15],[5,5,6,5],[18,6,18,15],[8,5,9,5],[12,5,13,5],[14,5,17,5],[25,6,25,15],[78,5,79,5],[120,14,120,15],[117,5,118,5],[116,6,116,15],[87,5,87,14],[113,6,113,15],[100,6,100,15],[103,6,103,15],[104,5,107,5],[122,11,122,12],[122,14,122,15],[19,5,20,5],[114,5,115,5],[101,5,102,5],[40,6,40,15],[77,6,77,15],[81,11,81,12],[81,14,81,15],[83,11,83,12],[83,14,83,15],[120,11,120,12],[21,5,24,5],[31,5,34,5],[95,6,95,15],[108,6,108,15]]}
[null,null,null,"Day",3,"UNITED NATIONS WORLD DATA FORUM 2021"]
[null,"NOW (Local time)",{"$f":"NOW()","v":"2021-10-11T11:48:40.820"},"Month",10,"KURSAAL Conference Centre, Bern, Switzerland"]
[null,"GMT+2/UTC+2 (Bern time)",{"$f":"Local2GMT(NOW())+(2/24)","v":{"$error":"#NAME?"}},"Year",2021,"Final Programme, as of 11 October 2021 (^)"]
["Day0",null,null,null,null,{"$f":"IF(ISERROR(DATE($E$3,$E$2,$E$1)+TIME(MID(E15,1,2),MID(E15,4,2),0)+($C$2-$C$3)),DATE($E$3,$E$2,$E$1),DATE($E$3,$E$2,$E$1)+TIME(MID(E15,1,2),MID(E15,4,2),0)+($C$2-$C$3))","v":"2021-10-03"}]
[null,null,"LookUp",null,null,null,"LookUp","Parallel 01","Parallel 02","Parallel 03","Parallel 04","Parallel 05","Parallel 06","Parallel 07","Parallel 08","Parallel 09"]
[null,null,null,null,null,"Time (Auto-adjusts to your local time, unless \"(Bern time)\" shown)","Rm Name","Arena","Aare","Szenario 2","Panorama 2-4","Panorama 1","Szenario 1 (^^)","Aare 1 (^^)","Aare 2 (^^)","Aare 3 (^^)"]
["DayTime_LookUp","Day_LookUp","Time_LookUp","Col_LookUp","Time (GMT/UTC time+2)",null,"Capacity",1357,298,221,199,125,131,63,63,75]
[{"$f":"B8&C8","v":"Day0Time_Slot1"},"Day0","Time_Slot1",16,"15:00 - 16:45 (BERN Time)",{"$f":"IF(ISERROR(TEXT((DATE($E$3,$E$2,$E$1)+TIME(MID(E8,1,2),MID(E8,4,2),0))+($C$2-$C$3),\"H:MM AM/PM\")&\" - \"&TEXT(DATE($E$3,$E$2,$E$1)+TIME(MID(E8,9,2),MID(E8,12,2),0)+($C$2-$C$3),\"H:MM AM/PM\")),E8,TEXT((DATE($E$3,$E$2,$E$1)+TIME(MID(E8,1,2),MID(E8,4,2),0))+($C$2-$C$3),\"H:MM AM/PM\")&\" - \"&TEXT(DATE($E$3,$E$2,$E$1)+TIME(MID(E8,9,2),MID(E8,12,2),0)+($C$2-$C$3),\"H:MM AM/PM\"))","v":"15:00 - 16:45 (BERN Time)"},"Event Title",{"$f":"IF(VLOOKUP($B8&\"_\"&$C8&\"_\"&H$12,UNWDF2021_LookUp!$B:$R,$D8,FALSE)=0,\"\",VLOOKUP($B8&\"_\"&$C8&\"_\"&H$12,UNWDF2021_LookUp!$B:$R,$D8,FALSE))","v":"Opening session"}]
[{"$f":"B9&C9","v":"Day0Time_Slot2"},"Day0","Time_Slot2",16,"16:45 - 18:00 (BERN Time)",{"$f":"IF(ISERROR(TEXT((DATE($E$3,$E$2,$E$1)+TIME(MID(E9,1,2),MID(E9,4,2),0))+($C$2-$C$3),\"H:MM AM/PM\")&\" - \"&TEXT(DATE($E$3,$E$2,$E$1)+TIME(MID(E9,9,2),MID(E9,12,2),0)+($C$2-$C$3),\"H:MM AM/PM\")),E9,TEXT((DATE($E$3,$E$2,$E$1)+TIME(MID(E9,1,2),MID(E9,4,2),0))+($C$2-$C$3),\"H:MM AM/PM\")&\" - \"&TEXT(DATE($E$3,$E$2,$E$1)+TIME(MID(E9,9,2),MID(E9,12,2),0)+($C$2-$C$3),\"H:MM AM/PM\"))","v":"16:45 - 18:00 (BERN Time)"},"Event Title",{"$f":"IF(VLOOKUP($B9&\"_\"&$C9&\"_\"&H$12,UNWDF2021_LookUp!$B:$R,$D9,FALSE)=0,\"\",VLOOKUP($B9&\"_\"&$C9&\"_\"&H$12,UNWDF2021_LookUp!$B:$R,$D9,FALSE))","v":"Opening reception (in-person only)"}]
["Day0Time_Slot2","Day0","Time_Slot2",17,"",null,"Organiser",{"$f":"IF(VLOOKUP($B10&\"_\"&$C10&\"_\"&H$12,UNWDF2021_LookUp!$B:$R,$D10,FALSE)=0,\"\",VLOOKUP($B10&\"_\"&$C10&\"_\"&H$12,UNWDF2021_LookUp!$B:$R,$D10,FALSE))","v":"Swiss Confederation"}]
["Day1",null,null,null,"",{"$f":"IF(ISERROR(DATE($E$3,$E$2,$E$1+1)+TIME(MID(E26,1,2),MID(E26,4,2),0)+($C$2-$C$3)),DATE($E$3,$E$2,$E$1+1),DATE($E$3,$E$2,$E$1+1)+TIME(MID(E26,1,2),MID(E26,4,2),0)+($C$2-$C$3))","v":"2021-10-04"}]
[null,null,"LookUp",null,null,null,"LookUp","Parallel 01","Parallel 02","Parallel 03","Parallel 04","Parallel 05","Parallel 06","Parallel 07","Parallel 08","Parallel 09"]
[null,null,null,null,null,"Time (Auto-adjusts to your local time, unless \"(Bern time)\" shown)","Rm Name","Arena","Aare","Szenario 2","Panorama 2-4","Panorama 1","Szenario 1 (^^)","Aare 1 (^^)","Aare 2 (^^)","Aare 3 (^^)"]
["DayTime_LookUp","Day_LookUp","Time_LookUp","Col_LookUp","Time (GMT/BERN time+2)",null,"Capacity",1357,298,221,199,125,131,63,63,75]
[{"$f":"B15&C15","v":"Day1Time_Slot1"},"Day1","Time_Slot1",15,"09:00 - 10:00 (BERN time)",{"$f":"IF(ISERROR(TEXT((DATE($E$3,$E$2,$E$1+1)+TIME(MID(E15,1,2),MID(E15,4,2),0))+($C$2-$C$3),\"H:MM AM/PM\")&\" - \"&TEXT(DATE($E$3,$E$2,$E$1+1)+TIME(MID(E15,9,2),MID(E15,12,2),0)+($C$2-$C$3),\"H:MM AM/PM\")),E15,TEXT((DATE($E$3,$E$2,$E$1+1)+TIME(MID(E15,1,2),MID(E15,4,2),0))+($C$2-$C$3),\"H:MM AM/PM\")&\" - \"&TEXT(DATE($E$3,$E$2,$E$1+1)+TIME(MID(E15,9,2),MID(E15,12,2),0)+($C$2-$C$3),\"H:MM AM/PM\"))","v":"09:00 - 10:00 (BERN time)"},"Event_ID",{"$f":"IF(VLOOKUP($B15&\"_\"&$C15&\"_\"&H$12,UNWDF2021_LookUp!$B:$R,$D15,FALSE)=0,\"\",VLOOKUP($B15&\"_\"&$C15&\"_\"&H$12,UNWDF2021_LookUp!$B:$R,$D15,FALSE))","v":"TA2.02"},{"$f":"IF(VLOOKUP($B15&\"_\"&$C15&\"_\"&I$12,UNWDF2021_LookUp!$B:$R,$D15,FALSE)=0,\"\",VLOOKUP($B15&\"_\"&$C15&\"_\"&I$12,UNWDF2021_LookUp!$B:$R,$D15,FALSE))","v":"TA6.02"},{"$f":"IF(VLOOKUP($B15&\"_\"&$C15&\"_\"&J$12,UNWDF2021_LookUp!$B:$R,$D15,FALSE)=0,\"\",VLOOKUP($B15&\"_\"&$C15&\"_\"&J$12,UNWDF2021_LookUp!$B:$R,$D15,FALSE))","v":"TA3.02"},{"$f":"IF(VLOOKUP($B15&\"_\"&$C15&\"_\"&K$12,UNWDF2021_LookUp!$B:$R,$D15,FALSE)=0,\"\",VLOOKUP($B15&\"_\"&$C15&\"_\"&K$12,UNWDF2021_LookUp!$B:$R,$D15,FALSE))","v":"TA2.17"},{"$f":"IF(VLOOKUP($B15&\"_\"&$C15&\"_\"&L$12,UNWDF2021_LookUp!$B:$R,$D15,FALSE)=0,\"\",VLOOKUP($B15&\"_\"&$C15&\"_\"&L$12,UNWDF2021_LookUp!$B:$R,$D15,FALSE))","v":"TA5.15"},{"$f":"IF(VLOOKUP($B15&\"_\"&$C15&\"_\"&M$12,UNWDF2021_LookUp!$B:$R,$D15,FALSE)=0,\"\",VLOOKUP($B15&\"_\"&$C15&\"_\"&M$12,UNWDF2021_LookUp!$B:$R,$D15,FALSE))","v":"TA4.10"},{"$f":"IF(VLOOKUP($B15&\"_\"&$C15&\"_\"&N$12,UNWDF2021_LookUp!$B:$R,$D15,FALSE)=0,\"\",VLOOKUP($B15&\"_\"&$C15&\"_\"&N$12,UNWDF2021_LookUp!$B:$R,$D15,FALSE))","v":"TA5.04"},{"$f":"IF(VLOOKUP($B15&\"_\"&$C15&\"_\"&O$12,UNWDF2021_LookUp!$B:$R,$D15,FALSE)=0,\"\",VLOOKUP($B15&\"_\"&$C15&\"_\"&O$12,UNWDF2021_LookUp!$B:$R,$D15,FALSE))","v":"TA2.03"},{"$f":"IF(VLOOKUP($B15&\"_\"&$C15&\"_\"&P$12,UNWDF2021_LookUp!$B:$R,$D15,FALSE)=0,\"\",VLOOKUP($B15&\"_\"&$C15&\"_\"&P$12,UNWDF2021_LookUp!$B:$R,$D15,FALSE))","v":""}]
{"$rows_left_out":111}
{"sheet":"UNWDF2021_LookUp","index":1,"n_rows":205,"n_cols":29,"rows_kept":205,"cut":false,"hidden":true,"merged":[]}
["ID","LookUp","Day/Time","Day","Time_Slot","Location","Date","Time","Duration","Room_Name","Room_Capacity","UNWDF2021_Plenary","UNWDF2021_ProposalID","UNWDF2021_TA","UNWDF2021_Session","UNWDF2021_ProgrammeID","UNWDF2021_SessionTitle","UNWDF2021_SessionOrg","LookUp"]
[1,{"$f":"C2&\"_\"&F2","v":"Day0_Time_Slot1_Parallel 01"},{"$f":"$D$1&D2&\"_\"&$E$1&E2","v":"Day0_Time_Slot1"},0,1,"Parallel 01",{"$f":"VLOOKUP($D$1&D2,Bern2021!A:F,6,FALSE)","v":"2021-10-03"},{"$f":"MID(VLOOKUP($D$1&D2&$E$1&E2,Bern2021!A:F,5,FALSE),1,SEARCH(\"(\",VLOOKUP($D$1&D2&$E$1&E2,Bern2021!A:F,5,FALSE))-2)","v":"15:00 - 16:45"},{"$f":"TEXT(MID(H2,SEARCH(\"-\",H2)+2,LEN(H2)-SEARCH(\"-\",H2)-1)-MID(H2,1,SEARCH(\"-\",H2)-1),\"h:mm\")","v":"1:45"},{"$f":"HLOOKUP($F2,Bern2021!$H$12:$P$14,2,FALSE)","v":"Arena"},{"$f":"HLOOKUP($F2,Bern2021!$H$12:$P$14,3,FALSE)","v":1357},"Y","NA","_O",{"$f":"IF(OR(L2=\"NA\",L2=\"E\"),\"NA\",IF(L2=\"Y\",COUNTIF($M$1:N1,N2)+1,COUNTIF($M$1:N1,N2)+1))","v":1},"TA_O.01A","Opening session","Swiss Confederation",{"$f":"B2","v":"Day0_Time_Slot1_Parallel 01"}]
[10,"Day0_Time_Slot2_Parallel 01","Day0_Time_Slot2",0,2,"Parallel 01",{"$f":"VLOOKUP($D$1&D3,Bern2021!A:F,6,FALSE)","v":"2021-10-03"},{"$f":"MID(VLOOKUP($D$1&D3&$E$1&E3,Bern2021!A:F,5,FALSE),1,SEARCH(\"(\",VLOOKUP($D$1&D3&$E$1&E3,Bern2021!A:F,5,FALSE))-2)","v":"16:45 - 18:00"},"1:15",{"$f":"HLOOKUP($F3,Bern2021!$H$12:$P$14,2,FALSE)","v":"Arena"},{"$f":"HLOOKUP($F3,Bern2021!$H$12:$P$14,3,FALSE)","v":1357},"Y","NA","_O",{"$f":"IF(OR(L3=\"NA\",L3=\"E\"),\"NA\",IF(L3=\"Y\",COUNTIF($M$1:N2,N3)+1,COUNTIF($M$1:N2,N3)+1))","v":2},"TA_O.01B","Opening reception (in-person only)","Swiss Confederation","Day0_Time_Slot2_Parallel 01"]
[20,"Day1_Time_Slot2_Parallel 01","Day1_Time_Slot2",1,2,"Parallel 01",{"$f":"VLOOKUP($D$1&D4,Bern2021!A:F,6,FALSE)","v":"2021-10-04"},{"$f":"MID(VLOOKUP($D$1&D4&$E$1&E4,Bern2021!A:F,5,FALSE),1,SEARCH(\"(\",VLOOKUP($D$1&D4&$E$1&E4,Bern2021!A:F,5,FALSE))-2)","v":"10:30 - 10:45"},"0:15",{"$f":"HLOOKUP($F4,Bern2021!$H$12:$P$14,2,FALSE)","v":"Arena"},{"$f":"HLOOKUP($F4,Bern2021!$H$12:$P$14,3,FALSE)","v":1357},"Y","NA","_O",{"$f":"IF(OR(L4=\"NA\",L4=\"E\"),\"NA\",IF(L4=\"Y\",COUNTIF($M$1:N3,N4)+1,COUNTIF($M$1:N3,N4)+1))","v":3},"TA_O.02","Welcome to UNWDF2021","United Nations (UN); Swiss Confederation","Day1_Time_Slot2_Parallel 01"]
[29,"Day1_Time_Slot3_Parallel 01","Day1_Time_Slot3",1,3,"Parallel 01",{"$f":"VLOOKUP($D$1&D5,Bern2021!A:F,6,FALSE)","v":"2021-10-04"},{"$f":"MID(VLOOKUP($D$1&D5&$E$1&E5,Bern2021!A:F,5,FALSE),1,SEARCH(\"(\",VLOOKUP($D$1&D5&$E$1&E5,Bern2021!A:F,5,FALSE))-2)","v":"10:45 - 12:00"},"1:15",{"$f":"HLOOKUP($F5,Bern2021!$H$12:$P$14,2,FALSE)","v":"Arena"},{"$f":"HLOOKUP($F5,Bern2021!$H$12:$P$14,3,FALSE)","v":1357},"Y","NA",1,{"$f":"IF(OR(L5=\"NA\",L5=\"E\"),\"NA\",IF(L5=\"Y\",COUNTIF($M$1:N4,N5)+1,COUNTIF($M$1:N4,N5)+1))","v":1},"TA1.01","Have we been going about capacity development the wrong way?","United Nations World Data Forum (UNWDF) Programme Committee","Day1_Time_Slot3_Parallel 01"]
[38,"Day1_Time_Slot4_Parallel 01","Day1_Time_Slot4",1,4,"Parallel 01",{"$f":"VLOOKUP($D$1&D6,Bern2021!A:F,6,FALSE)","v":"2021-10-04"},{"$f":"MID(VLOOKUP($D$1&D6&$E$1&E6,Bern2021!A:F,5,FALSE),1,SEARCH(\"(\",VLOOKUP($D$1&D6&$E$1&E6,Bern2021!A:F,5,FALSE))-2)","v":"13:15 - 14:30"},"1:15",{"$f":"HLOOKUP($F6,Bern2021!$H$12:$P$14,2,FALSE)","v":"Arena"},{"$f":"HLOOKUP($F6,Bern2021!$H$12:$P$14,3,FALSE)","v":1357},"Y","NA",2,{"$f":"IF(OR(L6=\"NA\",L6=\"E\"),\"NA\",IF(L6=\"Y\",COUNTIF($M$1:N5,N6)+1,COUNTIF($M$1:N5,N6)+1))","v":1},"TA2.01","How to innovate timely data for Covid-19 and the SDGs","United Nations World Data Forum (UNWDF) Programme Committee","Day1_Time_Slot4_Parallel 01"]
[56,"Day1_Time_Slot6_Parallel 01","Day1_Time_Slot6",1,6,"Parallel 01",{"$f":"VLOOKUP($D$1&D7,Bern2021!A:F,6,FALSE)","v":"2021-10-04"},{"$f":"MID(VLOOKUP($D$1&D7&$E$1&E7,Bern2021!A:F,5,FALSE),1,SEARCH(\"(\",VLOOKUP($D$1&D7&$E$1&E7,Bern2021!A:F,5,FALSE))-2)","v":"16:15 - 17:30"},"1:15",{"$f":"HLOOKUP($F7,Bern2021!$H$12:$P$14,2,FALSE)","v":"Arena"},{"$f":"HLOOKUP($F7,Bern2021!$H$12:$P$14,3,FALSE)","v":1357},"Y","NA",3,{"$f":"IF(OR(L7=\"NA\",L7=\"E\"),\"NA\",IF(L7=\"Y\",COUNTIF($M$1:N6,N7)+1,COUNTIF($M$1:N6,N7)+1))","v":1},"TA3.01","Leaving no one behind, the need to measure equity","United Nations World Data Forum (UNWDF) Programme Committee","Day1_Time_Slot6_Parallel 01"]
[65,"Day1_Time_Slot7_Parallel 01","Day1_Time_Slot7",1,7,"Parallel 01",{"$f":"VLOOKUP($D$1&D8,Bern2021!A:F,6,FALSE)","v":"2021-10-04"},{"$f":"MID(VLOOKUP($D$1&D8&$E$1&E8,Bern2021!A:F,5,FALSE),1,SEARCH(\"(\",VLOOKUP($D$1&D8&$E$1&E8,Bern2021!A:F,5,FALSE))-2)","v":"17:45 - 19:15"},"1:30",{"$f":"HLOOKUP($F8,Bern2021!$H$12:$P$14,2,FALSE)","v":"Arena"},{"$f":"HLOOKUP($F8,Bern2021!$H$12:$P$14,3,FALSE)","v":1357},"Y","NA","_S",{"$f":"IF(OR(L8=\"NA\",L8=\"E\"),\"NA\",IF(L8=\"Y\",COUNTIF($M$1:N7,N8)+1,COUNTIF($M$1:N7,N8)+1))","v":1},"TA_S.01","Meet 'n' Jazz - Part 1 (in-person only)","Entrepreneurs’ Organization EO","Day1_Time_Slot7_Parallel 01"]
[75,"Day2_Time_Slot2_Parallel 01","Day2_Time_Slot2",2,2,"Parallel 01",{"$f":"VLOOKUP($D$1&D9,Bern2021!A:F,6,FALSE)","v":"2021-10-05"},{"$f":"MID(VLOOKUP($D$1&D9&$E$1&E9,Bern2021!A:F,5,FALSE),1,SEARCH(\"(\",VLOOKUP($D$1&D9&$E$1&E9,Bern2021!A:F,5,FALSE))-2)","v":"10:30 - 11:45"},"1:15",{"$f":"HLOOKUP($F9,Bern2021!$H$12:$P$14,2,FALSE)","v":"Arena"},{"$f":"HLOOKUP($F9,Bern2021!$H$12:$P$14,3,FALSE)","v":1357},"Y","NA",4,{"$f":"IF(OR(L9=\"NA\",L9=\"E\"),\"NA\",IF(L9=\"Y\",COUNTIF($M$1:N8,N9)+1,COUNTIF($M$1:N8,N9)+1))","v":1},"TA4.01","Making it add up, counting on data and statistics during pandemics and other disasters","United Nations World Data Forum (UNWDF) Programme Committee","Day2_Time_Slot2_Parallel 01"]
[84,"Day2_Time_Slot3_Parallel 01","Day2_Time_Slot3",2,3,"Parallel 01",{"$f":"VLOOKUP($D$1&D10,Bern2021!A:F,6,FALSE)","v":"2021-10-05"},{"$f":"MID(VLOOKUP($D$1&D10&$E$1&E10,Bern2021!A:F,5,FALSE),1,SEARCH(\"(\",VLOOKUP($D$1&D10&$E$1&E10,Bern2021!A:F,5,FALSE))-2)","v":"13:15 - 14:30"},"1:15",{"$f":"HLOOKUP($F10,Bern2021!$H$12:$P$14,2,FALSE)","v":"Arena"},{"$f":"HLOOKUP($F10,Bern2021!$H$12:$P$14,3,FALSE)","v":1357},"Y","NA",5,{"$f":"IF(OR(L10=\"NA\",L10=\"E\"),\"NA\",IF(L10=\"Y\",COUNTIF($M$1:N9,N10)+1,COUNTIF($M$1:N9,N10)+1))","v":1},"TA5.01","Trust in Data: balancing quality, privacy and transparency","United Nations World Data Forum (UNWDF) Programme Committee","Day2_Time_Slot3_Parallel 01"]
[111,"Day2_Time_Slot6_Parallel 01","Day2_Time_Slot6",2,6,"Parallel 01",{"$f":"VLOOKUP($D$1&D11,Bern2021!A:F,6,FALSE)","v":"2021-10-05"},{"$f":"MID(VLOOKUP($D$1&D11&$E$1&E11,Bern2021!A:F,5,FALSE),1,SEARCH(\"(\",VLOOKUP($D$1&D11&$E$1&E11,Bern2021!A:F,5,FALSE))-2)","v":"19:30 - 23:59"},"4:29",{"$f":"HLOOKUP($F11,Bern2021!$H$12:$P$14,2,FALSE)","v":"Arena"},{"$f":"HLOOKUP($F11,Bern2021!$H$12:$P$14,3,FALSE)","v":1357},"Y","NA","_S",{"$f":"IF(OR(L11=\"NA\",L11=\"E\"),\"NA\",IF(L11=\"Y\",COUNTIF($M$1:N10,N11)+1,COUNTIF($M$1:N10,N11)+1))","v":2},"TA_S.02","Gala evening (in-person only)","Swiss Confederation","Day2_Time_Slot6_Parallel 01"]
[130,"Day3_Time_Slot3_Parallel 01","Day3_Time_Slot3",3,3,"Parallel 01",{"$f":"VLOOKUP($D$1&D12,Bern2021!A:F,6,FALSE)","v":"2021-10-06"},{"$f":"MID(VLOOKUP($D$1&D12&$E$1&E12,Bern2021!A:F,5,FALSE),1,SEARCH(\"(\",VLOOKUP($D$1&D12&$E$1&E12,Bern2021!A:F,5,FALSE))-2)","v":"11:15 - 12:30"},"1:15",{"$f":"HLOOKUP($F12,Bern2021!$H$12:$P$14,2,FALSE)","v":"Arena"},{"$f":"HLOOKUP($F12,Bern2021!$H$12:$P$14,3,FALSE)","v":1357},"Y","NA",7,{"$f":"IF(OR(L12=\"NA\",L12=\"E\"),\"NA\",IF(L12=\"Y\",COUNTIF($M$1:N11,N12)+1,COUNTIF($M$1:N11,N12)+1))","v":1},"TA7.01","Data for Accountability to the People","Swiss Agency for Development and Cooperation (SDC)","Day3_Time_Slot3_Parallel 01"]
[148,"Day3_Time_Slot5_Parallel 01","Day3_Time_Slot5",3,5,"Parallel 01",{"$f":"VLOOKUP($D$1&D13,Bern2021!A:F,6,FALSE)","v":"2021-10-06"},{"$f":"MID(VLOOKUP($D$1&D13&$E$1&E13,Bern2021!A:F,5,FALSE),1,SEARCH(\"(\",VLOOKUP($D$1&D13&$E$1&E13,Bern2021!A:F,5,FALSE))-2)","v":"15:15 - 16:30"},"1:15",{"$f":"HLOOKUP($F13,Bern2021!$H$12:$P$14,2,FALSE)","v":"Arena"},{"$f":"HLOOKUP($F13,Bern2021!$H$12:$P$14,3,FALSE)","v":1357},"Y","NA",6,{"$f":"IF(OR(L13=\"NA\",L13=\"E\"),\"NA\",IF(L13=\"Y\",COUNTIF($M$1:N12,N13)+1,COUNTIF($M$1:N12,N13)+1))","v":1},"TA6.01","The road from Bern … navigating the data future","High-level Group for Partnership, Coordination and Capacity-Building for Statistics (HLG-PCCB) for the 2030 Agenda for Sustainable Development","Day3_Time_Slot5_Parallel 01"]
[157,"Day3_Time_Slot6_Parallel 01","Day3_Time_Slot6",3,6,"Parallel 01",{"$f":"VLOOKUP($D$1&D14,Bern2021!A:F,6,FALSE)","v":"2021-10-06"},{"$f":"MID(VLOOKUP($D$1&D14&$E$1&E14,Bern2021!A:F,5,FALSE),1,SEARCH(\"(\",VLOOKUP($D$1&D14&$E$1&E14,Bern2021!A:F,5,FALSE))-2)","v":"16:45 - 17:30"},"0:45",{"$f":"HLOOKUP($F14,Bern2021!$H$12:$P$14,2,FALSE)","v":"Arena"},{"$f":"HLOOKUP($F14,Bern2021!$H$12:$P$14,3,FALSE)","v":1357},"Y","NA","_C",{"$f":"IF(OR(L14=\"NA\",L14=\"E\"),\"NA\",IF(L14=\"Y\",COUNTIF($M$1:N13,N14)+1,COUNTIF($M$1:N13,N14)+1))","v":1},"TA_C.01","Closing session","Swiss Confederation; United Nations (UN)","Day3_Time_Slot6_Parallel 01"]
[166,"Day3_Time_Slot7_Parallel 01","Day3_Time_Slot7",3,7,"Parallel 01",{"$f":"VLOOKUP($D$1&D15,Bern2021!A:F,6,FALSE)","v":"2021-10-06"},{"$f":"MID(VLOOKUP($D$1&D15&$E$1&E15,Bern2021!A:F,5,FALSE),1,SEARCH(\"(\",VLOOKUP($D$1&D15&$E$1&E15,Bern2021!A:F,5,FALSE))-2)","v":"17:45 - 19:15"},"1:30",{"$f":"HLOOKUP($F15,Bern2021!$H$12:$P$14,2,FALSE)","v":"Arena"},{"$f":"HLOOKUP($F15,Bern2021!$H$12:$P$14,3,FALSE)","v":1357},"Y","NA","_S",{"$f":"IF(OR(L15=\"NA\",L15=\"E\"),\"NA\",IF(L15=\"Y\",COUNTIF($M$1:N14,N15)+1,COUNTIF($M$1:N14,N15)+1))","v":3},"TA_S.03","Meet 'n' Jazz - Part 2 (in-person only)","Swiss Confederation","Day3_Time_Slot7_Parallel 01"]
{"$rows_left_out":190}